{"text_format":"1","workbook":"xlsx","n_sheets":12,"sheets":["taille","graph","moteur test","moteurs et mesures","base mesures","adaptation","test hélices","moteurs","moteur-hélice","LiPo","pour info","mesures hélices"],"not_rendered":{"charts":57,"images":0,"macros":1,"external_links":0,"defined_names":0,"comments":0,"pivot_tables":0},"unopened":[],"bounds":{"document_bytes":16777216,"sheet_cells":100000,"rows_first":2000,"rows_last":500,"rows_between":2000,"halvings":0,"cell_chars":16384,"cell_head_chars":4096},"cells_cut":0,"cells_raw":0,"read":"whole","date_system":"1900"}

{"sheet":"taille","index":0,"n_rows":43,"n_cols":31,"rows_kept":43,"cut":false,"hidden":false,"merged":[]}
[]
[null,null,null,"Classe du quadricoptère",900,"mm"]
[null,null,null," (espace entre les hélices 1 et 2)",null,null,null,null,null,null,null,null,null,null,null,null,null,null,null,null,null,"angle","CX","CY","1, 4 X","1, 3 Y","2, 3 X","2, 4 Y","angle","X","Y"]
[null,null,null,"poids estimé de la machine ≈",4250,"grs",null,null,null,null,null,null,null,null,null,null,null,null,null,null,null,null,null,null,{"$f":"$E$2/2*2^0.5","v":636.3961030678928},{"$f":"$E$2/2*2^0.5","v":636.3961030678928},{"$f":"-($E$2/2*2^0.5)","v":-636.3961030678928},{"$f":"-($E$2/2*2^0.5)","v":-636.3961030678928},45,{"$f":"(COS(PI()*45/180)*$Q$19/2)","v":97.227182413150288},{"$f":"(SIN(PI()*45/180)*$Q$19/2)","v":97.227182413150274}]
[null,null,null,null,null,null,null,null,null,null,null,null,null,null,null,null,null,null,null,null,null,0,{"$f":"COS(PI()*V5/180)*$Q$19/2","v":137.5},{"$f":"SIN(PI()*V5/180)*$Q$19/2","v":0},{"$f":"(COS(PI()*V5/180)*$E$2/2)+$Y$4","v":1086.3961030678929},{"$f":"$Z$4+(SIN(PI()*V5/180)*$E$2/2)","v":636.3961030678928},{"$f":"(COS(PI()*V5/180)*$E$2/2)+$AA$4","v":-186.3961030678928},{"$f":"(SIN(PI()*V5/180)*$E$2/2)+$AB$4","v":-636.3961030678928},null,{"$f":"$Y$4","v":636.3961030678928},{"$f":"$Y$4","v":636.3961030678928}]
[null,null,null,"taillle des hélices",{"$f":"INT(E2/25.4+1)/2","v":18},"pouces",null,null,null,null,null,null,null,null,null,null,null,null,null,null,null,10,135.41106603917859,23.87662442920292,1079.5595919233865,714.5377830180114,-193.2326142123992,-558.25442311777419,135,{"$f":"-AD4","v":-97.227182413150288},{"$f":"AE4","v":97.227182413150274}]
{"$rows_left_out":38}
{"sheet":"graph","index":1,"n_rows":0,"n_cols":0,"rows_kept":0,"cut":false,"hidden":false,"merged":[]}

{"sheet":"moteur test","index":2,"n_rows":52,"n_cols":42,"rows_kept":52,"cut":false,"hidden":false,"merged":[]}
[null,null,null,null,null,null,null,null,null,null,null,null,null,null,null,null,null,null,"position","marque","type","Ri","Io","Pmax","KV","Imax"]
[null,null,"Encodez ici différents paramètres estimés",null,null,null,null,null,null,null,null,null,"Encodez ici les paramètres du moteur de test choisi",null,null,null,null,null,{"$f":"CONCATENATE(\"B\",FIXED(Y4+1,0),\":H\",FIXED(Y4+1,0))","v":"B9:H9"},{"$f":"N3","v":"Turnigy Multistar"},{"$f":"R3","v":"4014-320KV 22 Poles"},{"$f":"R9","v":0.10199999999999999},{"$f":"R10","v":0.7},{"$f":"R6","v":720},{"$f":"R7","v":320},{"$f":"R11","v":26}]
[null,null,"paramètres hélice",null,null,null,null,null,null,null,null,null,"marque","Turnigy Multistar",null,null,"type du moteur","4014-320KV 22 Poles"]
[null,null,null,null,null,"hélice idéale",{"$f":"taille!E6","v":18},"pouces",null,null,null,null,null,null,null,null,null,null,null,null,"Indiquez les paramètres connus du moteur pressenti pour tester les hélices",null,null,"en n°",8,{"$f":"IF(VLOOKUP('moteur test'!Y4,'moteurs et mesures'!A:C,3)>\"\",\"ATTENTION: un moteur est déjà présent sous ce numéro\",\"\")","v":"ATTENTION: un moteur est déjà présent sous ce numéro"}]
[null,null,null,null,null,"remplacée par  une hélice",18,"pouces",null,null,null,null,null,null,null,null,null,null,null,null,"vous pouvez changer les paramètres pour voir si votre moteur correspond"]
[null,null,null,null,null,"En prenant comme base de départ une efficacité d'hélice de ",10.3,"grs/Watts",null,"Eff",null,null,null,null,null,null,"puissance",720,"Watts",{"$f":"IF(R6<G21,G21,R6)","v":720},"Watts",{"$f":"IF(R6<T6,CONCATENATE(\"la puissance devrait être de \",FIXED(T6,0),\" Watts\"),\"\")","v":""}]
{"$rows_left_out":47}
{"sheet":"moteurs et mesures","index":3,"n_rows":51,"n_cols":26,"rows_kept":51,"cut":false,"hidden":false,"merged":[]}
["n°","marque du moteur et","type","Ri","Io","Pmax","KV","Imax","Poids",{"$f":"CONCATENATE(\"B\",FIXED((P2-1)*3+1,0),\":O\",FIXED((P2-1)*3+1,0))","v":"B118:O118"}]
[1,"Turnigy AX","2810Q-750Kv",0.11,0.6,444,750,24,70,null,null,null,null,null,"sera copié dans base mesure en n°",{"$f":"MAX('base mesures'!V:V)/3+1","v":40},1,2,3,4,5,6,7,8,9,10]
[2,"Turnigy Multistar","3508 - 380 KV",0.215,0.3,320,380,14,102,null,null,null,"marque","diamètre","pas","RPM",2580,2700,3210,3350,3900,4100,4380]
[3,"AX","4008Q-620KV",0.11,0.3,1000,620,54,88,null,null,null,"RCTimer2",18,4,"traction",625,865,1005,1305,1430,1605,1910]
[4,"Turnigy Multistar","4010 375KV",0.13400000000000001,0.6,450,375,20,128,null,null,null,null,null,null,"P méc",{"$f":"IF(Q7*Q8*Q9>0,(Q9-($N$8*Q7))*(Q7-$N$9),0)","v":34.496499999999997},62.607579622641509,82.795860289855071,115.95968435643566,139.02987050847457,164.49166702702703,212.61771219512198,{"$f":"IF(X7*X8*X9>0,(X9-($N$8*X7))*(X7-$N$9),0)","v":0},0,0]
[5,"Turnigy Multistar","4010-485KV 22 Poles",8.5000000000000006E-2,0.8,500,320,26,128,null,null,null,"moteur n°",8]
{"$rows_left_out":46}
{"sheet":"base mesures","index":4,"n_rows":600,"n_cols":39,"rows_kept":600,"cut":false,"hidden":false,"merged":[]}
[1,"marque","diamètre","pas","RPM",4162,5151,5742,7143,7914,null,null,null,null,null,"facteur F","exp F","n10N","facteur P","exp P","n100W",{"$f":"IF(SUM(F1:O1)>0,1,0)","v":1},"pour adaptation",null,"Hélice n°",4,null,1]
[null,"RCTimer",13,4,"traction",550,850,1020,1320,1800,null,null,null,null,null,39,1.85,5857,1.6,2.4300000000000002,5700,{"$f":"IF(SUM(F2:O2)>0,1+V1,0)","v":2},"rangée du tableau",null,{"$f":"(Z1-1)*3+1","v":10},null,null,2]
[null,null,null,null,"P méc",53.040527128716398,90.830644389253095,114.77456389091,176.55303129244601,240.176023009537,null,null,null,null,null,null,null,null,null,null,null,{"$f":"IF(SUM(F3:O3)>0,1+V2,0)","v":3},null,null,null,null,null,3]
[2,"marque","diamètre","pas","RPM",4660,5000,6600,null,null,null,null,null,null,null,null,null,null,null,null,null,4,{"$f":"INDEX($A:$O,$Y$2,2)","v":"marque"},{"$f":"INDEX($A:$O,$Y$2,3)","v":"diamètre"},{"$f":"INDEX($A:$O,$Y$2,4)","v":"pas"},null,null,4]
[null,"RCTimer",13,6.5,"traction",850,1000,1700,null,null,null,null,null,null,null,45,"1,92",5100,"1,1","2,8",5100,5,{"$f":"INDEX($A:$O,$Y$2+1,2)","v":"RCTimer"},{"$f":"INDEX($A:$O,$Y$2+1,3)","v":18},{"$f":"INDEX($A:$O,$Y$2+1,4)","v":4},null,null,5]
[null,null,null,null,"P méc",79.966838432900204,112.561823368329,198.17209694614499,null,null,null,null,null,null,null,null,null,null,null,null,null,6,{"$f":"INDEX(C:Q,$Y$2,3)","v":"RPM"},{"$f":"INDEX(C:Q,$Y$2+1,3)","v":"traction"},{"$f":"INDEX(C:Q,$Y$2-1,3)","v":"P méc"},null,null,6]
{"$rows_left_out":595}
{"sheet":"adaptation","index":5,"n_rows":55,"n_cols":20,"rows_kept":55,"cut":false,"hidden":false,"merged":[]}
[null,"mesures",{"$f":"'base mesures'!Y1","v":"Hélice n°"},{"$f":"'base mesures'!Z1","v":4},null,null,null,"calcul pour",null,null,null,"adaptation:"]
[null,null,{"$f":"'base mesures'!W5","v":"RCTimer"},{"$f":"'base mesures'!X5","v":18},{"$f":"'base mesures'!Y5","v":4},null,null,"l'adaptation","selon","selon",null,"modifiez les facteurs et exposants en"]
[null,null,null,null,null,null,"pour","pour","n10N ","n100W",null,"commencant par ces valeurs de départ"]
[null,null,null,null,null,null,"exp=2","exp=3",{"$f":"M6","v":3200},{"$f":"P6","v":3450},{"$f":"G6","v":93.89459768042785},2,{"$f":"'base mesures'!AM19","v":3169.0364358658526},{"$f":"H6","v":1.5244907389938644},3,{"$f":"'base mesures'!AM20","v":3528.7349698474268}]
[null,"RPM","F","P méc","n10N","n100W","facteur F","facteur P","F","P méc","facteur F","exp F","n10N","facteur P","exp P","n100W","F","P méc","n10N","n100W"]
[1,{"$f":"'base mesures'!W7","v":2580},{"$f":"'base mesures'!X7","v":625},{"$f":"'base mesures'!Y7","v":26.180860000000003},{"$f":"IF(B6*C6>0,B6*(10/(9.80665*C6/1000))^0.5,0)","v":3295.4851539805259},{"$f":"IF(B6*D6>0,B6*(100/D6)^(1/3),0)","v":4032.9707281476822},{"$f":"IF(B6*C6>0,C6/(B6/1000)^2,0)","v":93.89459768042785},{"$f":"IF(B6*D6>0,D6/(B6/1000)^3,0)","v":1.5244907389938644},{"$f":"IF($I$4>0,(B6/$I$4)^2/0.000980665,0)","v":662.8553711002229},{"$f":"IF($J$4>0,(B6/$J$4)^3*100,0)","v":41.821714473576073},85,2.11,3200,2.6,2.95,3450,{"$f":"IF(B6*$K$6*$L$6>0,$K$6*(B6/1000)^$L$6,0)","v":627.96654216402169},{"$f":"IF(B6*$N$6*$O$6>0,$N$6*(B6/1000)^$O$6,0)","v":42.58449295570064},{"$f":"IF(B6*Q6>0,B6*(10/(9.80665*Q6/1000))^0.5,0)","v":3287.6919292208258},{"$f":"IF(B6*R6>0,B6*(100/R6)^(1/3),0)","v":3429.2768348757841}]
{"$rows_left_out":50}
{"sheet":"test hélices","index":6,"n_rows":88,"n_cols":49,"rows_kept":88,"cut":false,"hidden":false,"merged":[]}
["diamètre hélice conseillé",null,null,{"$f":"taille!E6","v":18}]
[null,null,null,null,null,null,null,null,"Utiliser le moteur de moteurs et mesures n°",8,null,null,null,null,"gamme des forces de traction",null,null,null,null,null,{"$f":"IF(V2*X2>0,CONCATENATE(B11,\" - \",F10),\"\")","v":"Hélice n°1 - 1"},{"$f":"C13","v":13},{"$f":"IF(V2*X2>0,\"x\",\"\")","v":"x"},{"$f":"C14","v":4},{"$f":"E20","v":8.647803285614895},{"$f":"IF(Y2>0,\"grs/watt\",\"\")","v":"grs/watt"},null,null,null,{"$f":"IF(Y2=MAX($Y$2,$Y$3,$Y$4,$Y$5,$Y$6,$Y$7),CONCATENATE(\" à \",FIXED(E18,0),\" trs/min, meilleure hélice\"),CONCATENATE(\" à \",FIXED(E18,0),\" trs/min                                \"))","v":" à 5.969 trs/min                                "}]
[null,null,null,null,"moteur de test",null,null,"P",{"$f":"INDEX('moteurs et mesures'!F:M,'test hélices'!$J$2+1,1)","v":720},"watts",null,{"$f":"'moteur test'!G10","v":1063},{"$f":"($Q$3-$L$3)/5+L3","v":1276.4000000000001},{"$f":"($Q$3-$L$3)/5+M3","v":1489.8000000000002},{"$f":"($Q$3-$L$3)/5+N3","v":1703.2000000000003},{"$f":"($Q$3-$L$3)/5+O3","v":1916.6000000000004},{"$f":"'moteur test'!G16","v":2130},"grs",null,null,{"$f":"IF(V3*X3>0,CONCATENATE(B24,\" - \",F23),\"\")","v":"Hélice n°2 - 2"},{"$f":"C26","v":13},"x",{"$f":"C27","v":6.5},{"$f":"E33","v":9.6024300281120993},"grs/watt",null,null,null,{"$f":"IF(Y3=MAX($Y$2,$Y$3,$Y$4,$Y$5,$Y$6,$Y$7),CONCATENATE(\" à \",FIXED(E31,0),\" trs/min, meilleure hélice\"),CONCATENATE(\" à \",FIXED(E31,0),\" trs/min                                \"))","v":" à 5.191 trs/min                                "}]
[null,null,null,null,{"$f":"INDEX('moteurs et mesures'!B:I,'test hélices'!$J$2+1,1)","v":"Turnigy Multistar"},null,null,"KV",{"$f":"INDEX('moteurs et mesures'!G:N,'test hélices'!$J$2+1,1)","v":320},null,null,null,null,null,null,null,null,null,null,null,{"$f":"IF(V4*X4>0,CONCATENATE(B37,\" - \",F36),\"\")","v":"Hélice n°3 - 3"},{"$f":"C39","v":14},"x",{"$f":"C40","v":4.7},{"$f":"E46","v":8.1365913430340253},"grs/watt",null,null,null,{"$f":"IF(Y4=MAX($Y$2,$Y$3,$Y$4,$Y$5,$Y$6,$Y$7),CONCATENATE(\" à \",FIXED(E44,0),\" trs/min, meilleure hélice\"),CONCATENATE(\" à \",FIXED(E44,0),\" trs/min                                \"))","v":" à 5.644 trs/min                                "}]
[null,null,null,null,{"$f":"INDEX('moteurs et mesures'!C:J,'test hélices'!$J$2+1,1)","v":"4014-320KV 22 Poles"},null,null,"ri",{"$f":"INDEX('moteurs et mesures'!D:K,'test hélices'!$J$2+1,1)","v":0.10199999999999999},"ohm",null,null,null,null,null,null,null,null,null,null,{"$f":"IF(V5*X5>0,CONCATENATE(B50,\" - \",F49),\"\")","v":"Hélice n°4 - 4"},{"$f":"C52","v":18},"x",{"$f":"C53","v":4},{"$f":"E59","v":11.958581834687742},"grs/watt",null,null,null,{"$f":"IF(Y5=MAX($Y$2,$Y$3,$Y$4,$Y$5,$Y$6,$Y$7),CONCATENATE(\" à \",FIXED(E57,0),\" trs/min, meilleure hélice\"),CONCATENATE(\" à \",FIXED(E57,0),\" trs/min                                \"))","v":" à 3.311 trs/min, meilleure hélice"}]
[null,null,null,null,null,null,null,"I0",{"$f":"INDEX('moteurs et mesures'!E:L,'test hélices'!$J$2+1,1)","v":0.7},"ampère(s)",null,null,null,null,null,null,null,null,null,null,{"$f":"IF(V6*X6>0,CONCATENATE(B63,\" - \",F62),\"\")","v":"Hélice n°5 - 5"},{"$f":"C65","v":18},"x",{"$f":"C66","v":5.5},{"$f":"E72","v":9.2639602478494201},"grs/watt",null,null,null,{"$f":"IF(Y6=MAX($Y$2,$Y$3,$Y$4,$Y$5,$Y$6,$Y$7),CONCATENATE(\" à \",FIXED(E70,0),\" trs/min, meilleure hélice\"),CONCATENATE(\" à \",FIXED(E70,0),\" trs/min                                \"))","v":" à 3.223 trs/min                                "}]
{"$rows_left_out":83}
{"sheet":"moteurs","index":7,"n_rows":100,"n_cols":25,"rows_kept":100,"cut":false,"hidden":false,"merged":[]}
[null,"au départ",null,"rapport traction max/poids",{"$f":"IF(E3=0,'moteur test'!G15,E3)","v":2.35},null,"traction en stationnaire",{"$f":"E2/4","v":1062.5},"grs / moteur",{"$f":"H1/1000*9.806","v":10.418875},"Newtons",null,null,null,null,null,"Helice 1","Helice 2","Helice 3","Helice 4","Helice 5","Helice 6"]
[null,null,null,"poids du quadricoptère",{"$f":"IF(E4=0,taille!E4,E4)","v":4250},"grs",null,{"$f":"FIXED($H$1*(1+$E$1)/2,0)","v":"1.780"},"grs / moteur",{"$f":"CONCATENATE(\"traction/poids de \",FIXED((1+$E$1)/2,1))","v":"traction/poids de 1,7"},null,null,null,null,null,"marque",{"$f":"'test hélices'!C12","v":"RCTimer"},{"$f":"'test hélices'!C25","v":"RCTimer"},{"$f":"'test hélices'!C38","v":"RCTimer"},{"$f":"'test hélices'!C51","v":"RCTimer"},{"$f":"'test hélices'!C64","v":"HK"},{"$f":"'test hélices'!C77","v":""}]
[null,"modifier ?",null,"rapport traction max/poids",2.35,null,null,{"$f":"FIXED($H$1*$E$1,0)","v":"2.497"},"grs / moteur",{"$f":"CONCATENATE(\"traction/poids de \",FIXED(E1,1))","v":"traction/poids de 2,4"},null,null,null,null,null,"diamètre",{"$f":"'test hélices'!C13","v":13},{"$f":"'test hélices'!C26","v":13},{"$f":"'test hélices'!C39","v":14},{"$f":"'test hélices'!C52","v":18},{"$f":"'test hélices'!C65","v":18},{"$f":"'test hélices'!C78","v":0},"pouces"]
[null,null,null,"poids du quadricoptère",4250,null,null,null,null,null,null,null,null,null,null,"pas",{"$f":"'test hélices'!C14","v":4},{"$f":"'test hélices'!C27","v":6.5},{"$f":"'test hélices'!C40","v":4.7},{"$f":"'test hélices'!C53","v":4},{"$f":"'test hélices'!C66","v":5.5},{"$f":"'test hélices'!C79","v":0},"pouces"]
[null,null,null,null,null,null,null,null,null,null,null,null,null,null,null,"n100W",{"$f":"'test hélices'!C15","v":5700},{"$f":"'test hélices'!C28","v":5100},{"$f":"'test hélices'!C41","v":5350},{"$f":"'test hélices'!C54","v":3450},{"$f":"'test hélices'!C67","v":3020},{"$f":"'test hélices'!C80","v":""}]
[null,"moteur 1:",null,"dans moteurs et mesures n°",8,null,"rendements moteur 1",null,null,null,null,null,null,null,null,"n10N",{"$f":"'test hélices'!C16","v":5857},{"$f":"'test hélices'!C29","v":5100},{"$f":"'test hélices'!C42","v":5500},{"$f":"'test hélices'!C55","v":3200},{"$f":"'test hélices'!C68","v":3150},{"$f":"'test hélices'!C81","v":""}]
{"$rows_left_out":95}
{"sheet":"moteur-hélice","index":8,"n_rows":54,"n_cols":37,"rows_kept":54,"cut":false,"hidden":false,"merged":[]}
[null,null,null,null,null,{"$f":"'mesures hélices'!B10","v":"Helice 1"},null,null,{"$f":"'mesures hélices'!B25","v":"Helice 2"},null,null,{"$f":"'mesures hélices'!B40","v":"Helice 3"},null,null,{"$f":"'mesures hélices'!B55","v":"Helice 4"},null,null,{"$f":"'mesures hélices'!B70","v":"Helice 5"},null,null,{"$f":"'mesures hélices'!B85","v":"Helice 6"}]
[null,null,null,null,null,{"$f":"'mesures hélices'!B11","v":"marque"},{"$f":"'test hélices'!C12","v":"RCTimer"},null,{"$f":"'mesures hélices'!B26","v":"marque"},{"$f":"'test hélices'!C25","v":"RCTimer"},null,{"$f":"'mesures hélices'!B41","v":"marque"},{"$f":"'test hélices'!C38","v":"RCTimer"},null,{"$f":"'mesures hélices'!B56","v":"marque"},{"$f":"'test hélices'!C51","v":"RCTimer"},null,{"$f":"'mesures hélices'!B71","v":"marque"},{"$f":"'test hélices'!C64","v":"HK"},null,{"$f":"'mesures hélices'!B86","v":"marque"},{"$f":"'test hélices'!C77","v":""}]
[null,null,null,null,null,{"$f":"'mesures hélices'!B12","v":"diamètre"},{"$f":"'test hélices'!C13","v":13},null,{"$f":"'mesures hélices'!B27","v":"diamètre"},{"$f":"'test hélices'!C26","v":13},null,{"$f":"'mesures hélices'!B42","v":"diamètre"},{"$f":"'test hélices'!C39","v":14},null,{"$f":"'mesures hélices'!B57","v":"diamètre"},{"$f":"'test hélices'!C52","v":18},null,{"$f":"'mesures hélices'!B72","v":"diamètre"},{"$f":"'test hélices'!C65","v":18},null,{"$f":"'mesures hélices'!B87","v":"diamètre"},{"$f":"'test hélices'!C78","v":0}]
[null,null,null,null,null,{"$f":"'mesures hélices'!B13","v":"pas"},{"$f":"'test hélices'!C14","v":4},null,{"$f":"'mesures hélices'!B28","v":"pas"},{"$f":"'test hélices'!C27","v":6.5},null,{"$f":"'mesures hélices'!B43","v":"pas"},{"$f":"'test hélices'!C40","v":4.7},null,{"$f":"'mesures hélices'!B58","v":"pas"},{"$f":"'test hélices'!C53","v":4},null,{"$f":"'mesures hélices'!B73","v":"pas"},{"$f":"'test hélices'!C66","v":5.5},null,{"$f":"'mesures hélices'!B88","v":"pas"},{"$f":"'test hélices'!C79","v":0}]
[null,null,null,null,null,{"$f":"'mesures hélices'!B14","v":"n100W"},{"$f":"'test hélices'!C15","v":5700},null,{"$f":"'mesures hélices'!B29","v":"n100W"},{"$f":"'test hélices'!C28","v":5100},null,{"$f":"'mesures hélices'!B44","v":"n100W"},{"$f":"'test hélices'!C41","v":5350},null,{"$f":"'mesures hélices'!B59","v":"n100W"},{"$f":"'test hélices'!C54","v":3450},null,{"$f":"'mesures hélices'!B74","v":"n100W"},{"$f":"'test hélices'!C67","v":3020},null,{"$f":"'mesures hélices'!B89","v":"n100W"},{"$f":"'test hélices'!C80","v":""}]
[null,null,null,null,null,{"$f":"'mesures hélices'!B15","v":"n10N"},{"$f":"'test hélices'!C16","v":5857},null,{"$f":"'mesures hélices'!B30","v":"n10N"},{"$f":"'test hélices'!C29","v":5100},null,{"$f":"'mesures hélices'!B45","v":"n10N"},{"$f":"'test hélices'!C42","v":5500},null,{"$f":"'mesures hélices'!B60","v":"n10N"},{"$f":"'test hélices'!C55","v":3200},null,{"$f":"'mesures hélices'!B75","v":"n10N"},{"$f":"'test hélices'!C68","v":3150},null,{"$f":"'mesures hélices'!B90","v":"n10N"},{"$f":"'test hélices'!C81","v":""}]
{"$rows_left_out":49}
{"sheet":"LiPo","index":9,"n_rows":63,"n_cols":31,"rows_kept":63,"cut":false,"hidden":false,"merged":[]}
[null,null,null,null,null,null,null,null,null,null,null,null,null,null,null,null,null,null,1,2,3,4,5,6,null,null,1,2,3]
[null,"Rappel:",null,null,null,null,null,null,null,null,null,null,null,null,null,null,null,null,"hélice 1","hélice 2","hélice 3","hélice 4","hélice 5","hélice 6",null,null,{"$f":"moteurs!E7","v":"Turnigy Multistar"},{"$f":"moteurs!E39","v":"Turnigy Multistar"},{"$f":"moteurs!E71","v":"Turnigy"}]
[null,null,null,null,null,null,null,{"$f":"'moteur-hélice'!L51","v":"efficacité maximale dans la moitié inférieure de la plage des tractions:"},{"$f":"'moteur-hélice'!M51","v":10.490885783762938},{"$f":"'moteur-hélice'!N51","v":"grs/watt"},null,null,null,"Choix moteur",1,null,null,"n100W",{"$f":"moteurs!Q5","v":5700},{"$f":"moteurs!R5","v":5100},{"$f":"moteurs!S5","v":5350},{"$f":"moteurs!T5","v":3450},{"$f":"moteurs!U5","v":3020},{"$f":"moteurs!V5","v":""},{"$f":"HLOOKUP(O4,S1:X8,3,FALSE)","v":3450},"n100W",{"$f":"moteurs!E8","v":"4014-320KV 22 Poles"},{"$f":"moteurs!E40","v":"4230-400Kv 16 Poles"},{"$f":"moteurs!E72","v":"4260 500KV"}]
[null,null,null,null,null,null,{"$f":"'moteur-hélice'!G52","v":"avec le"},{"$f":"'moteur-hélice'!H52","v":"moteur 1:"},null,{"$f":"'moteur-hélice'!I52","v":"Turnigy Multistar 4014-320KV 22 Poles"},null,null,null,"Choix hélice",4,null,null,"n10N",{"$f":"moteurs!Q6","v":5857},{"$f":"moteurs!R6","v":5100},{"$f":"moteurs!S6","v":5500},{"$f":"moteurs!T6","v":3200},{"$f":"moteurs!U6","v":3150},{"$f":"moteurs!V6","v":""},{"$f":"HLOOKUP(O4,S1:X8,4,FALSE)","v":3200},"n10N",{"$f":"moteurs!E9","v":720},{"$f":"moteurs!E41","v":550},{"$f":"moteurs!E73","v":1000},{"$f":"HLOOKUP($O$3,$AA$1:$AC$9,4,FALSE)","v":720},{"$f":"moteurs!F9","v":"watts"}]
[null,null,null,null,null,null,{"$f":"'moteur-hélice'!G53","v":"et l'"},{"$f":"'moteur-hélice'!H53","v":"hélice 4:"},null,{"$f":"'moteur-hélice'!N53","v":0},null,null,null,"poids du quadricoptère",{"$f":"moteurs!E4","v":4250},"grs",null," kf",{"$f":"moteurs!Q7","v":39},{"$f":"moteurs!R7","v":45},{"$f":"moteurs!S7","v":39},{"$f":"moteurs!T7","v":85},{"$f":"moteurs!U7","v":90},{"$f":"moteurs!V7","v":0},{"$f":"HLOOKUP(O4,S1:X8,5,FALSE)","v":85}," kf",{"$f":"moteurs!E10","v":320},{"$f":"moteurs!E42","v":400},{"$f":"moteurs!E74","v":500},{"$f":"HLOOKUP($O$3,$AA$1:$AC$9,5,FALSE)","v":320},"KV"]
[null,null,null,null,null,null,null,null,null,null,null,null,null,null,null,null,null,"exp_f",{"$f":"moteurs!Q8","v":1.85},{"$f":"moteurs!R8","v":"1,92"},{"$f":"moteurs!S8","v":1.91},{"$f":"moteurs!T8","v":"2,11"},{"$f":"moteurs!U8","v":2.11},{"$f":"moteurs!V8","v":0},{"$f":"HLOOKUP(O4,S1:X8,6,FALSE)","v":"2,11"},"exp_f",{"$f":"moteurs!E11","v":6},{"$f":"moteurs!E43","v":6},{"$f":"moteurs!E75","v":6},{"$f":"moteurs!F11","v":"S"}]
{"$rows_left_out":58}
{"sheet":"pour info","index":10,"n_rows":151,"n_cols":35,"rows_kept":151,"cut":false,"hidden":false,"merged":[]}
[null,null,null,"Pour information, voici des relevés d'hélices surprenants. "]
[null,null,null,"Les pas sont loin de correspondre à la théorie et, au delà de 15° d'incidence, un profil décroche. "]
[null,null,null,"Il n'y a vraiment aucun intérêt à choisir de grands pas !"]
[]
[null,null,null,"hélices",null,"angles à"]
[null,null,null,"diamètre","pas",25,50,75,100,"% du diamètre"]
{"$rows_left_out":146}
{"sheet":"mesures hélices","index":11,"n_rows":98,"n_cols":53,"rows_kept":98,"cut":false,"hidden":false,"merged":[]}
["diamètre hélice conseillé",null,null,{"$f":"taille!E6","v":18}]
[null,null,null,null,null,null,"moteur de test","P",{"$f":"'moteur test'!T6","v":720},"watts",null,"gamme des forces de traction conseillée pour les test",null,null,null,null,null,null,null,null,{"$f":"IF(V2*X2>0,CONCATENATE(B10,\" \",C11),\"\")","v":"Helice 1 RCTimer"},{"$f":"C12","v":13},{"$f":"IF(V2*X2>0,\"x\",\"\")","v":"x"},{"$f":"C13","v":4},{"$f":"E19","v":8.6726692404114338},{"$f":"IF(Y2>0,\"grs/watt\",\"\")","v":"grs/watt"},null,null,null,{"$f":"IF(Y2=MAX($Y$2,$Y$3,$Y$4,$Y$5,$Y$6,$Y$7),CONCATENATE(\" à \",FIXED(E17,0),\" trs/min, meilleure hélice\"),CONCATENATE(\" à \",FIXED(E17,0),\" trs/min                                \"))","v":" à 5.862 trs/min                                "}]
[null,null,null,null,null,null,{"$f":"IF('moteur test'!R3=\"\",\"\",'moteur test'!R3)","v":"4014-320KV 22 Poles"},"KV",{"$f":"'moteur test'!T7","v":320},null,null,{"$f":"'moteur test'!AE29*0.8","v":850.40000000000009},{"$f":"($Q$3-$L$3)/5+L3","v":1106.3200000000002},{"$f":"($Q$3-$L$3)/5+M3","v":1362.2400000000002},{"$f":"($Q$3-$L$3)/5+N3","v":1618.1600000000003},{"$f":"($Q$3-$L$3)/5+O3","v":1874.0800000000004},{"$f":"'moteur test'!AN29","v":2130},"grs",null,null,{"$f":"IF(V3*X3>0,CONCATENATE(B25,\" \",C26),\"\")","v":"Helice 2 RCTimer"},{"$f":"C27","v":13},"x",{"$f":"C28","v":6.5},{"$f":"E34","v":8.5642776847571902},"grs/watt",null,null,null,{"$f":"IF(Y3=MAX($Y$2,$Y$3,$Y$4,$Y$5,$Y$6,$Y$7),CONCATENATE(\" à \",FIXED(E32,0),\" trs/min, meilleure hélice\"),CONCATENATE(\" à \",FIXED(E32,0),\" trs/min                                \"))","v":" à 5.155 trs/min                                "}]
[null,null,null,null,null,null,null,"V",{"$f":"'moteur test'!T8*3.7","v":22.200000000000003},"volts",null,null,null,null,null,null,null,null,null,null,{"$f":"IF(V4*X4>0,CONCATENATE(B40,\" \",C41),\"\")","v":"Helice 3 RCTimer"},{"$f":"C42","v":14},"x",{"$f":"C43","v":4.7},{"$f":"E49","v":8.5549258696803623},"grs/watt",null,null,null,{"$f":"IF(Y4=MAX($Y$2,$Y$3,$Y$4,$Y$5,$Y$6,$Y$7),CONCATENATE(\" à \",FIXED(E47,0),\" trs/min, meilleure hélice\"),CONCATENATE(\" à \",FIXED(E47,0),\" trs/min                                \"))","v":" à 5.640 trs/min                                "}]
[null,null,null,null,null,null,null,"ri",{"$f":"'moteur test'!T9","v":0.10199999999999999},"ohm",null,null,null,null,null,null,null,null,null,null,{"$f":"IF(V5*X5>0,CONCATENATE(B55,\" \",C56),\"\")","v":"Helice 4 Turnigy"},{"$f":"C57","v":18},"x",{"$f":"C58","v":4},{"$f":"E64","v":14.565543736312998},"grs/watt",null,null,null,{"$f":"IF(Y5=MAX($Y$2,$Y$3,$Y$4,$Y$5,$Y$6,$Y$7),CONCATENATE(\" à \",FIXED(E62,0),\" trs/min, meilleure hélice\"),CONCATENATE(\" à \",FIXED(E62,0),\" trs/min                                \"))","v":" à 3.085 trs/min, meilleure hélice"}]
[null,null,null,null,null,null,null,"I0",{"$f":"'moteur test'!T10","v":0.7},"ampère(s)",null,null,null,null,null,null,null,null,null,null,{"$f":"IF(V6*X6>0,CONCATENATE(B70,\" \",C71),\"\")","v":"Helice 5 Turnigy"},{"$f":"C72","v":18},"x",{"$f":"C73","v":5.5},{"$f":"E79","v":11.094042193817591},"grs/watt",null,null,null,{"$f":"IF(Y6=MAX($Y$2,$Y$3,$Y$4,$Y$5,$Y$6,$Y$7),CONCATENATE(\" à \",FIXED(E77,0),\" trs/min, meilleure hélice\"),CONCATENATE(\" à \",FIXED(E77,0),\" trs/min                                \"))","v":" à 3.216 trs/min                                "}]
{"$rows_left_out":92}