{"text_format":"1","workbook":"xlsx","n_sheets":12,"sheets":["taille","graph","moteur test","moteurs et mesures","base mesures","adaptation","test hélices","moteurs","moteur-hélice","LiPo","pour info","mesures hélices"],"not_rendered":{"charts":57,"images":0,"macros":1,"external_links":0,"defined_names":0,"comments":0,"pivot_tables":0},"unopened":[],"bounds":{"document_bytes":16777216,"sheet_cells":100000,"rows_first":2000,"rows_last":500,"rows_between":2000,"halvings":0,"cell_chars":16384,"cell_head_chars":4096},"cells_cut":0,"cells_raw":0,"read":"whole","date_system":"1900"}

{"sheet":"taille","index":0,"n_rows":43,"n_cols":31,"rows_kept":43,"cut":false,"hidden":false,"merged":[]}
[]
[null,null,null,"Classe du quadricoptère",900,"mm"]
[null,null,null," (espace entre les hélices 1 et 2)",null,null,null,null,null,null,null,null,null,null,null,null,null,null,null,null,null,"angle","CX","CY","1, 4 X","1, 3 Y","2, 3 X","2, 4 Y","angle","X","Y"]
[null,null,null,"poids estimé de la machine ≈",4250,"grs",null,null,null,null,null,null,null,null,null,null,null,null,null,null,null,null,null,null,{"$f":"$E$2/2*2^0.5","v":636.3961030678928},{"$f":"$E$2/2*2^0.5","v":636.3961030678928},{"$f":"-($E$2/2*2^0.5)","v":-636.3961030678928},{"$f":"-($E$2/2*2^0.5)","v":-636.3961030678928},45,{"$f":"(COS(PI()*45/180)*$Q$19/2)","v":97.227182413150288},{"$f":"(SIN(PI()*45/180)*$Q$19/2)","v":97.227182413150274}]
[null,null,null,null,null,null,null,null,null,null,null,null,null,null,null,null,null,null,null,null,null,0,{"$f":"COS(PI()*V5/180)*$Q$19/2","v":137.5},{"$f":"SIN(PI()*V5/180)*$Q$19/2","v":0},{"$f":"(COS(PI()*V5/180)*$E$2/2)+$Y$4","v":1086.3961030678929},{"$f":"$Z$4+(SIN(PI()*V5/180)*$E$2/2)","v":636.3961030678928},{"$f":"(COS(PI()*V5/180)*$E$2/2)+$AA$4","v":-186.3961030678928},{"$f":"(SIN(PI()*V5/180)*$E$2/2)+$AB$4","v":-636.3961030678928},null,{"$f":"$Y$4","v":636.3961030678928},{"$f":"$Y$4","v":636.3961030678928}]
[null,null,null,"taillle des hélices",{"$f":"INT(E2/25.4+1)/2","v":18},"pouces",null,null,null,null,null,null,null,null,null,null,null,null,null,null,null,10,135.41106603917859,23.87662442920292,1079.5595919233865,714.5377830180114,-193.2326142123992,-558.25442311777419,135,{"$f":"-AD4","v":-97.227182413150288},{"$f":"AE4","v":97.227182413150274}]
[null,null,null,null,null,null,null,null,null,null,null,null,null,null,null,null,null,null,null,null,null,20,129.20773535806242,47.027769707279447,1059.2577824215516,790.30516756444376,-213.53442371423398,-482.48703857134188,null,{"$f":"-AD5","v":-636.3961030678928},{"$f":"AE5","v":636.3961030678928}]
[null,null,null,null,null,null,null,null,null,null,null,null,null,null,null,null,null,null,null,null,null,30,119.07849302036033,68.749999999999986,1026.1075347708902,861.3961030678928,-246.68467136489539,-411.3961030678928,225,{"$f":"-AD4","v":-97.227182413150288},-97.227182413150274]
[null,null,null,null,null,null,null,null,null,null,null,null,null,null,null,null,null,null,null,null,null,40,105.33111092885947,88.383296331899146,981.1161024714329,925.65052742683542,-291.67610366435269,-347.14167870895011,null,-636.3961030678928,-636.3961030678928]
[null,null,null,null,null,null,null,null,null,null,null,null,null,null,null,null,null,null,null,null,null,50,88.38329633189916,105.33111092885947,925.65052742683542,981.1161024714329,-347.14167870895011,-291.67610366435269,315,97.227182413150288,-97.227182413150274]
[null,null,null,null,null,null,null,null,null,null,null,null,null,null,null,null,null,null,null,null,null,60,68.750000000000014,119.07849302036031,861.39610306789291,1026.1075347708902,-411.39610306789274,-246.68467136489545,null,636.3961030678928,-636.3961030678928]
[null,null,null,null,null,null,null,null,null,null,null,null,null,null,null,null,null,null,null,null,null,70,47.027769707279461,129.20773535806239,790.30516756444376,1059.2577824215516,-482.48703857134183,-213.53442371423404]
[null,null,null,null,null,null,null,null,null,null,null,null,null,null,null,null,null,null,null,null,null,80,23.876624429202931,135.41106603917859,714.53778301801151,1079.5595919233865,-558.25442311777408,-193.2326142123992]
[null,null,null,null,null,null,null,null,null,null,null,null,null,null,null,null,null,null,null,null,null,90,8.4228956274967626E-15,137.5,636.3961030678928,1086.3961030678929,-636.3961030678928,-186.3961030678928]
[null,null,null,null,null,null,null,null,null,null,null,null,null,null,null,null,null,null,null,null,null,100,-23.876624429202916,135.41106603917859,558.25442311777419,1079.5595919233865,-714.5377830180114,-193.2326142123992]
[null,null,null,null,null,null,null,null,null,null,null,null,null,null,null,null,null,null,null,null,null,110,-47.027769707279447,129.20773535806242,482.48703857134188,1059.2577824215516,-790.30516756444376,-213.53442371423398]
[null,null,null,null,null,null,null,null,null,null,null,null,null,null,null,null,null,null,null,null,null,120,-68.749999999999972,119.07849302036033,411.39610306789291,1026.1075347708902,-861.39610306789268,-246.68467136489539]
[null,null,null,null,null,null,null,null,null,null,null,null,null,"←","Diamètre approximatif du centre du chassis",null,null,null,null,null,null,130,-88.38329633189916,105.33111092885947,347.14167870895011,981.1161024714329,-925.65052742683542,-291.67610366435269]
[null,null,null,null,null,null,null,null,null,null,null,null,null,null,null,null,{"$f":"INT((E6*25.4*0.6)+1)","v":275},"mm",null,null,null,140,-105.33111092885946,88.383296331899174,291.67610366435275,925.65052742683554,-981.1161024714329,-347.14167870895005]
[null,null,null,null,null,null,null,null,null,null,null,null,null,null,null,null,null,null,null,null,null,150,-119.07849302036033,68.749999999999986,246.68467136489539,861.3961030678928,-1026.1075347708902,-411.3961030678928]
[null,null,null,null,null,null,null,null,null,null,null,null,null,null,null,null,null,null,null,null,null,160,-129.20773535806239,47.027769707279468,213.53442371423404,790.30516756444376,-1059.2577824215516,-482.48703857134183]
[null,null,null,null,null,null,null,null,null,null,null,null,null,null,"Classe","D hélice",null,null,null,null,null,170,-135.41106603917859,23.876624429202913,193.2326142123992,714.5377830180114,-1079.5595919233865,-558.25442311777419]
[null,null,null,null,null,null,null,null,null,null,null,null,null,null,250,{"$f":"INT(O23/25.4+1)/2","v":5},null,null,null,null,null,180,-137.5,1.6845791254993525E-14,186.3961030678928,636.3961030678928,-1086.3961030678929,-636.3961030678928]
[null,null,null,null,null,null,null,null,null,null,null,null,null,null,300,6,null,null,null,null,null,190,-135.41106603917859,-23.876624429202941,193.2326142123992,558.25442311777408,-1079.5595919233865,-714.53778301801151]
[null,null,null,null,null,null,null,null,null,null,null,null,null,null,350,7,null,null,null,null,null,200,-129.20773535806242,-47.02776970727944,{"$f":"(COS(PI()*V25/180)*$E$2/2)+$Y$4","v":213.53442371423398},{"$f":"$Z$4+(SIN(PI()*V25/180)*$E$2/2)","v":482.48703857134194},{"$f":"(COS(PI()*V25/180)*$E$2/2)+$AA$4","v":-1059.2577824215516},{"$f":"(SIN(PI()*V25/180)*$E$2/2)+$AB$4","v":-790.30516756444365}]
[null,null,null,null,null,null,null,null,null,null,null,null,null,null,400,8,null,null,null,null,null,210,-119.07849302036031,-68.750000000000014,{"$f":"(COS(PI()*V26/180)*$E$2/2)+$Y$4","v":246.68467136489545},{"$f":"$Z$4+(SIN(PI()*V26/180)*$E$2/2)","v":411.39610306789274},{"$f":"(COS(PI()*V26/180)*$E$2/2)+$AA$4","v":-1026.1075347708902},{"$f":"(SIN(PI()*V26/180)*$E$2/2)+$AB$4","v":-861.39610306789291}]
[null,null,null,null,null,null,null,null,null,null,null,null,null,null,450,9,null,null,null,null,null,220,-105.33111092885947,-88.383296331899146,291.67610366435269,347.14167870895011,-981.1161024714329,-925.65052742683542]
[null,null,null,null,null,null,null,null,null,null,null,null,null,null,500,10,null,null,null,null,null,230,-88.383296331899174,-105.33111092885946,347.14167870895005,291.67610366435275,-925.65052742683554,-981.1161024714329]
[null,null,null,null,null,null,null,null,null,null,null,null,null,null,550,11,null,null,null,null,null,240,-68.750000000000057,-119.07849302036027,411.39610306789257,246.68467136489551,-861.39610306789302,-1026.1075347708902]
[null,null,null,null,null,null,null,null,null,null,null,null,null,null,600,12,null,null,null,null,null,250,-47.027769707279539,-129.20773535806237,482.4870385713416,213.53442371423409,-790.30516756444399,-1059.2577824215514]
[null,null,null,null,null,null,null,null,null,null,null,null,null,null,650,13,null,null,null,null,null,260,-23.87662442920292,-135.41106603917859,558.25442311777419,193.2326142123992,-714.5377830180114,-1079.5595919233865]
[null,null,null,null,null,null,null,null,null,null,null,null,null,null,700,14,null,null,null,null,null,270,-2.5268686882490288E-14,-137.5,636.39610306789268,186.3961030678928,-636.39610306789291,-1086.3961030678929]
[null,null,null,null,null,null,null,null,null,null,null,null,null,null,750,15,null,null,null,null,null,280,23.87662442920287,-135.41106603917862,714.53778301801128,193.23261421239914,-558.25442311777431,-1079.5595919233865]
[null,null,null,null,null,null,null,null,null,null,null,null,null,null,800,16,null,null,null,null,null,290,47.027769707279369,-129.20773535806242,790.30516756444354,213.53442371423398,-482.48703857134211,-1059.2577824215516]
[null,null,null,null,null,null,null,null,null,null,null,null,null,null,850,17,null,null,null,null,null,300,68.750000000000014,-119.07849302036031,861.39610306789291,246.68467136489545,-411.39610306789274,-1026.1075347708902]
[null,null,null,null,null,null,null,null,null,null,null,null,null,null,900,18,null,null,null,null,null,310,88.383296331899146,-105.33111092885949,925.65052742683542,291.67610366435264,-347.14167870895011,-981.1161024714329]
[null,null,null,null,null,null,null,null,null,null,null,null,null,null,950,19,null,null,null,null,null,320,105.33111092885945,-88.383296331899189,981.11610247143278,347.14167870895,-291.67610366435281,-925.65052742683565]
[null,null,null,null,null,null,null,null,null,null,null,null,null,null,1000,20,null,null,null,null,null,330,119.07849302036027,-68.750000000000057,1026.1075347708902,411.39610306789257,-246.68467136489551,-861.39610306789302]
[null,null,null,null,null,null,null,null,null,null,null,null,null,null,1100,22,null,null,null,null,null,340,129.20773535806242,-47.027769707279433,1059.2577824215516,482.48703857134194,-213.53442371423398,-790.30516756444365]
[null,null,null,null,null,null,null,null,null,null,null,null,null,null,1200,24,null,null,null,null,null,350,135.41106603917859,-23.876624429203051,1079.5595919233863,558.25442311777374,-193.23261421239926,-714.53778301801185]
[null,null,null,null,null,null,null,null,null,null,null,null,null,null,1300,26]
[null,null,null,null,null,null,null,null,null,null,null,null,null,null,1400,28]
[null,null,null,null,null,null,null,null,null,null,null,null,null,null,1500,30]

{"sheet":"graph","index":1,"n_rows":0,"n_cols":0,"rows_kept":0,"cut":false,"hidden":false,"merged":[]}

{"sheet":"moteur test","index":2,"n_rows":52,"n_cols":42,"rows_kept":52,"cut":false,"hidden":false,"merged":[]}
[null,null,null,null,null,null,null,null,null,null,null,null,null,null,null,null,null,null,"position","marque","type","Ri","Io","Pmax","KV","Imax"]
[null,null,"Encodez ici différents paramètres estimés",null,null,null,null,null,null,null,null,null,"Encodez ici les paramètres du moteur de test choisi",null,null,null,null,null,{"$f":"CONCATENATE(\"B\",FIXED(Y4+1,0),\":H\",FIXED(Y4+1,0))","v":"B9:H9"},{"$f":"N3","v":"Turnigy Multistar"},{"$f":"R3","v":"4014-320KV 22 Poles"},{"$f":"R9","v":0.10199999999999999},{"$f":"R10","v":0.7},{"$f":"R6","v":720},{"$f":"R7","v":320},{"$f":"R11","v":26}]
[null,null,"paramètres hélice",null,null,null,null,null,null,null,null,null,"marque","Turnigy Multistar",null,null,"type du moteur","4014-320KV 22 Poles"]
[null,null,null,null,null,"hélice idéale",{"$f":"taille!E6","v":18},"pouces",null,null,null,null,null,null,null,null,null,null,null,null,"Indiquez les paramètres connus du moteur pressenti pour tester les hélices",null,null,"en n°",8,{"$f":"IF(VLOOKUP('moteur test'!Y4,'moteurs et mesures'!A:C,3)>\"\",\"ATTENTION: un moteur est déjà présent sous ce numéro\",\"\")","v":"ATTENTION: un moteur est déjà présent sous ce numéro"}]
[null,null,null,null,null,"remplacée par  une hélice",18,"pouces",null,null,null,null,null,null,null,null,null,null,null,null,"vous pouvez changer les paramètres pour voir si votre moteur correspond"]
[null,null,null,null,null,"En prenant comme base de départ une efficacité d'hélice de ",10.3,"grs/Watts",null,"Eff",null,null,null,null,null,null,"puissance",720,"Watts",{"$f":"IF(R6<G21,G21,R6)","v":720},"Watts",{"$f":"IF(R6<T6,CONCATENATE(\"la puissance devrait être de \",FIXED(T6,0),\" Watts\"),\"\")","v":""}]
[null,null,null,null,null,"soit ≈",{"$f":"INT(100/G6+0.5)*10","v":100},"Watts/Kg",null,null,null,null,null,null,null,null,"KV",320,null,{"$f":"IF(R7>0,R7,G22*T11/(T6-(T9*T11^2)))","v":320},null,{"$f":"IF(T7<T12-1,CONCATENATE(\"le KV doit être au moins de \",FIXED(T12,0)),\"\")","v":""}]
[null,null,null,null,null,null,null,null,null,null,null,null,null,null,null,null,"pour une batterie de",6,"éléments",{"$f":"IF(R8>0,R8,6)","v":6},"éléments",{"$f":"IF(R8=0,\"(valeur par défaut)\",\"\")","v":""}]
[null,null,null,null,null,"et avec comme poids estimé de la machine ≈",{"$f":"taille!E4","v":4250},"grs",null,"M",null,null,null,null,null,null,"avec une résistance interne de ",0.10199999999999999,"ohm",{"$f":"IF(R9>0,R9,0)","v":0.10199999999999999},"ohm",{"$f":"IF(T9=0,\"sans valeur, les résultats peuvent manquer de précision\",\"\")","v":""}]
[null,null,null,null,null,"en stationnaire, chaque moteur devra fournir ≈",{"$f":"INT(G9/4+0.5)","v":1063},"grs ",null,"Fsta = M / 4",null,null,null,null,null,null,"courant à vide",0.7,"ampères",{"$f":"IF(R10>0,R10,0)","v":0.7},"ampères",{"$f":"IF(T10=0,\"sans valeur, les résultats peuvent manquer de précision\",\"\")","v":""}]
[null,null,null,null,null,"ce qui nécessite une puissance de ≈",{"$f":"G7*G10/1000","v":106.3},"Watts",null,"Psta = F / Eff",null,null,null,null,null,null,"courant maximum",26,"ampères",{"$f":"IF(R11>0,R11,T6/(T8*3.7))","v":26},"ampères",{"$f":"IF(R11/(T6/(3.7*T8))>1,\"ce courant paraît trop important\",IF(R11=0,IF(T11<(T6/(T8*3.7)),\"\",CONCATENATE(\"le courant maximum est de \",FIXED(T6/(T8*3.7)),\" ampères\")),\"\"))","v":""}]
[null,null,null,null,null,"la vitesse de rotation est alors de ≈",{"$f":"INT((30373*POWER(G10,0.5)/G5^2)/10+0.5)*10","v":3060},"trs/min",null,"n = 30373 x F1/2 / D2",null,null,null,null,null,null,null,null,{"$f":"IF(T9>0,CONCATENATE(\"pour \",FIXED(G22,0),\" trs/min, le KV minimum est de\"),\"l'évaluation imprécise du KV est de\")","v":"pour 4.331 trs/min, le KV minimum est de"},{"$f":"G22*T11/(T6-(T9*T11^2))","v":172.97941980250405}]
[]
[null,null,"paramètres machine",null,null,null,null,null,null,null,null,null,null,null,null,null,null,null,"en vol stationnaire à",{"$f":"G12","v":3060},"trs/min",{"$f":"IF(T9>0,\"\",\"précision ? car la valeur de résistance interne est inconnue\")","v":""}]
[null,null,null,null,null,"pour obtenir un rapport traction/poids de",2,null,null,"Fmax / M",null,null,null,null,null,null,null,null,"la tension moteur sera de",{"$f":"T14*(T16-T10)/(T16*T7)","v":9.1261556814792719},"volts",{"$f":"IF(T9>0,\"\",\"précision ? car la valeur de résistance interne est inconnue\")","v":""}]
[null,null,null,null,null,"la traction maximale est de ≈",{"$f":"INT(G10*G15/10+0.5)*10","v":2130},"grs",null,"Fmax = Fsta x Fmax / M",null,null,null,null,null,null,null,null,{"$f":"CONCATENATE(\"le courant attendu avec l'hélice \",FIXED(G5,0),\" pouces et un KV de \",FIXED(T7,0),\" est de\")","v":"le courant attendu avec l'hélice 18 pouces et un KV de 320 est de"},{"$f":"(T7*(INT(G11/8+1)*10)/T14)+T10","v":15.340522875816992},"ampères",{"$f":"IF(T16>T11,CONCATENATE(\"le courant maximum est de \",FIXED(T11),\" ampères\"),\"\")","v":""}]
[null,null,null,null,null,"la puissance mécanique nécessaire est de ≈",{"$f":"INT(G11*POWER(G15,3/2)/10+0.5)*10","v":300},"Watts",null,"Pmax = Psta x Fmax / M",null,null,null,null,null,null,null,null,{"$f":"IF(T16>T11,\"le moteur ne peut pas fournir les\",\"la puissance électrique sera de\")","v":"la puissance électrique sera de"},{"$f":"T15*T16","v":139.99999999999997},"Watts"]
[]
[null,null,"paramètres moteur"]
[null,null,null,null,null,"en supposant un rendement moteur de",88,"%",null,"η x 100"]
[null,null,null,null,null,"pour la traction maximale, le moteur test aura une puissance de ≈",{"$f":"G17*100/G20","v":340.90909090909093},"Watts",null,"Pm = P x η ",null,null,null,null,null,null,null,null,null,null,null,null,null,null,null,null,null,null,null,null,{"$f":"IF(OR((R25>3.7*$T$8),(R26>$T$11),(R27>$T$6)),0,1)","v":1},1,1,1,1,{"$f":"IF(OR((W25>3.7*$T$8),(W26>$T$11),(W27>$T$6)),0,1)","v":1},1,1,0,0,null,"limite en proportion du max absolu"]
[null,null,null,null,null,"la vitesse de rotation sera ≈",{"$f":"((30373*POWER(G16,0.5)/G5^2)/10+0.5)*10","v":4331.4578962915639},"trs/min",null,"n = 30373 x F1/2 / D2",null,null,null,null,null,"F","grs",{"$f":"G10","v":1063},{"$f":"(($AA$22-$R$22)/9)+R22","v":1181.5555555555557},1300.1111111111113,1418.666666666667,1537.2222222222226,{"$f":"(($AA$22-$R$22)/9)+V22","v":1655.7777777777783},1774.3333333333339,1892.8888888888896,2011.4444444444453,{"$f":"G16","v":2130},"grs",null,"F",{"$f":"R22/$AA$22","v":0.49906103286384979},{"$f":"S22/$AA$22","v":0.55472091810119983},0.61038080333854994,{"$f":"U22/$AA$22","v":0.66604068857589993},0.72170057381325003,0.77736045905060014,0.83302034428795024,0.88868022952530024,0.94434011476265034,{"$f":"AA22/$AA$22","v":1},"F"]
[null,null,null,null,null,null,null,null,null,null,null,null,null,null,null,"n","trs/min",{"$f":"G12","v":3060},{"$f":"$R$23*(S22/$R$22)^0.5","v":3226.1300280160717},3384.1143472604413,3535.045243416404,3679.7907319123356,3819.0541745744986,3953.414947359041,4083.3570384756795,4209.2896860795709,{"$f":"$R$23*(AA22/$R$22)^0.5","v":4331.5626070741291},"trs/min",null,"n",{"$f":"R23/$AA$23","v":0.70644251915060274},{"$f":"S23/$AA$23","v":0.74479589022845694},0.78126871391253716,{"$f":"U23/$AA$23","v":0.81611315917334637},0.8495296191500622,0.88168047446373676,0.91269948191502226,0.94269837674905343,0.9717716371466345,1,"n"]
[null,null,null,null,null,"avec une batterie de",6,"éléments",null,null,null,null,null,null,null,"Pméc","Watts",{"$f":"G11","v":106.3},{"$f":"$R$24*(S22/$R$22)^1.5","v":124.57032214205849},143.78185176940607,163.89055071873878,184.85804203343204,206.65049131993175,229.23777521560109,252.59284861100829,276.69125340268153,301.51073049241484,"Watts",null,"Pméc",{"$f":"R24/$AA$24","v":0.3525579332662398},{"$f":"S24/$AA$24","v":0.41315386002553012},0.47687142522121023,0.54356457049166884,0.61310601361195183,0.68538353836508148,0.76029723665628568,0.83775740982247671,0.91768293934614142,1,"Pméc"]
[null,null,null,null,null,"la tension est de",{"$f":"3.7*G24","v":22.200000000000003},"volts",null,"Vb",null,null,null,null,null,"V","volts",{"$f":"R23*(T16-$T$10)/($T$16*$T$7)","v":9.1261556814792719},{"$f":"S23*(S26-$T$10)/($T$16*$T$7)","v":10.150429938932591},11.715853244812283,13.354381076630222,15.062886344379821,16.83861210214177,18.679103791906485,20.582157682610596,22.545780841575919,24.568159518842119,"volts",null,"V",{"$f":"(R25/($AA$23*($AA$26-$T$10)/($T$16*$T$7)))","v":0.37146273307449534},{"$f":"(S25/($AA$23*($AA$26-$T$10)/($T$16*$T$7)))","v":0.41315386002553006},0.47687142522121023,0.54356457049166884,0.61310601361195183,0.68538353836508148,0.76029723665628568,0.8377574098224766,0.91768293934614142,1,"V"]
[null,null,null,null,null,null,null,null,null,null,null,null,null,null,null,"I","ampères",{"$f":"($T$7*(R24/0.8)/R23)+$T$10","v":14.595424836601307},16.145170660856934,17.694916485112564,19.244662309368195,20.794408133623826,22.344153957879456,23.893899782135083,25.443645606390703,26.993391430646337,28.543137254901954,"ampères",null,"I",{"$f":"R26/$AA$26","v":0.5113462022852695},{"$f":"S26/$AA$26","v":0.56564106869801734},0.61993593511076528,0.67423080152351322,0.72852566793626117,0.78282053434900911,0.83711540076175694,0.89141026717450444,0.94570513358725261,1,"I"]
[null,null,null,null,null,"en supposant une résistance interne du moteur de",0.1,"ohm",null,"ri",null,null,null,null,null,"Pélec","Watts",{"$f":"R25*R26","v":133.20011929615268},{"$f":"S25*S26","v":163.88042364513831},207.31104471878839,257.00055417036549,313.22380631542302,376.24454124726793,446.31663402391297,523.68512589119575,608.58708736622577,701.25234924663653,"Watts",null,"Pélec",{"$f":"R27/$AA$27","v":0.18994605784814997},{"$f":"S27/$AA$27","v":0.23369679092155191},0.29562973292211431,0.36648797604238209,0.44666346808238572,0.5365323077369677,0.63645652596158298,0.74678555651727474,0.86785746674508524,1,"Pélec"]
[null,null,null,null,null,"le KV minimum sera",{"$f":"G22*G25/(G25^2-G27*G21)","v":209.60993101287292},null,null,"KVmin =  n V / (V2 - ri P)",null,null,null,null,null,"rendement","η",{"$f":"IF(R27>0,R24/R27,0)","v":0.79804733330347954},{"$f":"IF(S27>0,S24/S27,0)","v":0.76012936366212525},0.69355615840170082,0.63770504794357696,0.59017877411040742,0.54924515485294723,0.5136214018035431,0.48233725978210928,0.45464529094778294,0.42996038561058836,"rendement"]
[null,null,null,null,null,null,null,null,null,null,null,null,null,null,null,null,null,null,null,null,null,null,null,null,null,null,null,null,null,"F",{"$f":"R22","v":1063},{"$f":"($AN$29-$AE$29)/10+AE29","v":1169.7},{"$f":"($AN$29-$AE$29)/10+AF29","v":1276.4000000000001},1383.1000000000001,1489.8000000000002,1596.5000000000002,1703.2000000000003,1809.9000000000003,1916.6000000000004,{"$f":"AA22","v":2130},"F","en chiffres jusqu'à la limite de traction possible"]
[null,null,null,null,null,null,null,null,null,null,null,null,null,null,null,null,null,null,null,null,null,null,null,null,null,null,null,"allure des courbes en proportion du maximum de leurs valeurs en fonction de la force de traction",null,"n",{"$f":"G12","v":3060},{"$f":"$AE$30*(AF29/$AE$29)^0.5","v":3209.9039645915082},{"$f":"$AE$30*(AG29/$AE$29)^0.5","v":3353.1130198370238},{"$f":"$AE$30*(AH29/$AE$29)^0.5","v":3490.4513154749557},3622.5866238919848,3750.0689739658674,3873.3578160817647,3992.8416238691434,4108.8523574353776,{"$f":"$AE$30*(AN29/$AE$29)^0.5","v":4331.5626070741291},"n"]
[null,null,"importer depuis moteurs et mesure le moteur n°",8,null,null,null,null,null,null,null,null,null,null,null,null,null,null,null,null,null,null,null,null,null,null,null,"la puissance mécanique évolue comme la tension",null,"Pméc",{"$f":"G11","v":106.3},{"$f":"$AE$31*(AF29/$AE$29)^1.5","v":122.70015252884598},{"$f":"$AE$31*(AG29/$AE$29)^1.5","v":139.86645289280972},157.76611811873894,176.370246806349,195.65310839661788,215.59160236439422,236.16483840002493,257.35380484511921,301.51073049241484,"Pméc"]
[null,null,null,null,null,null,{"$f":"INDEX('moteurs et mesures'!B:I,'moteur test'!D31+1,1)","v":"Turnigy Multistar"},{"$f":"INDEX('moteurs et mesures'!B:I,'moteur test'!D31+1,2)","v":"4014-320KV 22 Poles"},{"$f":"INDEX('moteurs et mesures'!B:I,'moteur test'!D31+1,3)","v":0.10199999999999999},{"$f":"INDEX('moteurs et mesures'!B:I,'moteur test'!D31+1,4)","v":0.7},{"$f":"INDEX('moteurs et mesures'!B:I,'moteur test'!D31+1,5)","v":720},{"$f":"INDEX('moteurs et mesures'!B:I,'moteur test'!D31+1,6)","v":320},{"$f":"INDEX('moteurs et mesures'!B:I,'moteur test'!D31+1,7)","v":26},null,null,null,null,null,null,null,null,null,null,null,null,null,null,null,null,"V",{"$f":"AE30*(AE33-$T$10)/($T$16*$T$7)","v":8.6616995441182745},{"$f":"AF30*(AF33-$T$10)/($T$16*$T$7)","v":9.9980419117812591},{"$f":"AG30*(AG33-$T$10)/($T$16*$T$7)","v":11.396812711750609},12.855340671555886,14.371270802996994,15.942506489222094,17.567165417830683,19.24354537258948,20.970097216407076,24.568159518842119,"V"]
[null,null,null,null,null,null,null,null,null,null,null,null,null,null,null,null,null,null,null,null,null,null,null,null,null,null,null,null,null,"I",{"$f":"($T$7*(AE31/0.8)/AE30)+$T$10","v":14.595424836601307},15.990196078431371,17.384967320261435,18.779738562091502,20.17450980392157,21.569281045751634,22.964052287581701,24.358823529411765,25.753594771241836,28.543137254901954,"I"]
[null,null,null,null,null,null,{"$f":"G32","v":"Turnigy Multistar"},null,null,null,{"$f":"H32","v":"4014-320KV 22 Poles"},null,null,null,null,null,null,null,null,null,null,null,null,null,null,null,null,null,null,"Pélec",{"$f":"AE32*AE33","v":126.42118465340208},{"$f":"AF32*AF33","v":159.87065056975717},198.13321654892445,241.41993693844134,289.93334370987469,343.86840303975055,403.41330519966084,468.75012581113555,540.05538602489423,701.25234924663653,"Pélec"]
[null,null,null,null,null,null,null,null,null,null,null,null,null,null,null,null,null,null,null,null,null,null,null,null,null,null,null,null,null,"η",{"$f":"AE31/AE34","v":0.84084008777036401},{"$f":"AF31/AF34","v":0.76749642346208879},0.70592127523591131,0.65349249991299219,{"$f":"AI31/AI34","v":0.60831308517186633},0.56897669767582792,0.53441867084104167,0.50381818669671841,0.47653224373778641,0.42996038561058836,"η"]
[]
[null,null,null,null,null,null,null,null,null,null,{"$f":"K32","v":720},null,null,null,null,null,null,null,null,null,null,null,null,null,null,null,null,null,null,"F",{"$f":"S22*(AE$21-AF$21)","v":0},{"$f":"T22*(AF$21-AG$21)","v":0},{"$f":"U22*(AG$21-AH$21)","v":0},{"$f":"V22*(AH$21-AI$21)","v":0},{"$f":"W22*(AI21-AJ21)","v":0},{"$f":"X22*(AJ21-AK21)","v":0},{"$f":"Y22*(AK21-AL21)","v":0},{"$f":"Z22*(AL21-AM21)","v":2011.4444444444453},{"$f":"AA22*(AM21-AN21)","v":0},{"$f":"SUM(AE37:AM37)","v":2011.4444444444453},null,"détection du maximum possible"]
[null,null,null,null,null,null,null,null,null,null,{"$f":"L32","v":320},null,null,null,null,null,null,null,null,null,null,null,null,null,null,null,null,null,null,"n",{"$f":"S$23*(AE$21-AF$21)","v":0},0,0,0,0,0,0,4209.2896860795709,0,4209.2896860795709]
[null,null,null,null,null,null,null,null,null,null,null,null,null,null,null,null,null,null,null,null,null,null,null,null,null,null,null,null,null,"Pméc",{"$f":"S$24*(AE$21-AF$21)","v":0},0,0,0,0,0,0,276.69125340268153,0,276.69125340268153]
[null,null,null,null,null,null,null,null,null,null,{"$f":"I32","v":0.10199999999999999},null,null,null,null,null,null,null,null,null,null,null,null,null,null,null,null,null,null,"V",{"$f":"S$25*(AE$21-AF$21)","v":0},0,0,0,0,0,0,22.545780841575919,0,22.545780841575919]
[null,null,null,null,null,null,null,null,null,null,{"$f":"J32","v":0.7},null,null,null,null,null,null,null,null,null,null,null,null,null,null,null,null,null,null,"I",{"$f":"S$26*(AE$21-AF$21)","v":0},0,0,0,0,0,0,26.993391430646337,0,26.993391430646337]
[null,null,null,null,null,null,null,null,null,null,{"$f":"M32","v":26},null,null,null,null,null,null,null,null,null,null,null,null,null,null,null,null,null,null,"Pélec",{"$f":"S$27*(AE$21-AF$21)","v":0},0,0,0,0,0,0,608.58708736622577,0,608.58708736622577]
[null,null,null,null,null,null,null,null,null,null,null,null,null,null,null,null,null,null,null,null,null,null,null,null,null,null,null,null,null,"η",0.8,{"$f":"S$28*(AE$21-AF$21)","v":0},{"$f":"T$28*(AF$21-AG$21)","v":0},0,0,0,{"$f":"X$28*(AJ$21-AK$21)","v":0},0,0.45464529094778294,{"$f":"AA$28*(AM$21-AN$21)","v":0}]
[]
[null,null,null,null,null,null,null,null,null,null,null,null,null,null,null,null,null,null,null,null,null,null,null,null,null,null,null,null,null,"F",{"$f":"AE29","v":1063},{"$f":"AF29","v":1169.7},1276.4000000000001,1383.1000000000001,1489.8000000000002,1596.5000000000002,1703.2000000000003,1809.9000000000003,1916.6000000000004,{"$f":"AN29","v":2130}]
[null,null,null,null,null,null,null,null,null,null,null,null,null,null,null,null,null,null,null,null,null,null,null,null,null,null,null,null,null,"n",{"$f":"AE30/$AN30","v":0.70644251915060274},0.74104988332599087,{"$f":"$AE$46*(AG45/$AE$45)^0.5","v":0.77411163683998441},0.80581804584204675,0.83632327464821277,0.86575430488789662,0.89421720691649642,0.92180166514232065,0.94858431706030744,{"$f":"AN30/$AN30","v":1},null,"en proportion"]
[null,null,null,null,null,null,null,null,null,null,null,null,null,null,null,null,null,null,null,null,null,null,null,null,null,null,null,null,null,"Pméc",0.3525579332662398,0.40695119649127304,{"$f":"$AE$47*(AG45/$AE$45)^1.5","v":0.46388548979462735},0.52325208413339674,0.58495512421169371,0.64890927124578723,0.71503790930524747,0.78327175293008744,0.85354774745435968,{"$f":"AN31/$AN31","v":1}]
[null,null,null,null,null,null,null,null,null,null,null,null,null,null,null,null,null,null,null,null,null,null,null,null,null,null,null,null,null,"V",0.3525579332662398,0.40695119649127304,{"$f":"AG32/$AN32","v":0.46388548979462724},0.52325208413339663,0.5849551242116936,0.64890927124578734,0.71503790930524747,0.78327175293008744,0.85354774745435968,{"$f":"AN32/$AN32","v":1}]
[null,null,null,null,null,null,null,null,null,null,null,null,null,null,null,null,null,null,null,null,null,null,null,null,null,null,null,null,null,"I",0.5113462022852695,0.5602115820567426,0.60907696182821558,0.65794234159968867,0.70680772137116188,0.75567310114263486,0.80453848091410807,0.85340386068558105,0.90226924045705437,{"$f":"AN33/$AN33","v":1}]
[null,null,null,null,null,null,null,null,null,null,null,null,null,null,null,null,null,null,null,null,null,null,null,null,null,null,null,null,null,"Pélec",0.18027916026123522,0.22797877360626037,0.28254196476030524,0.34426970148164432,0.41345079844845217,0.49036328136251139,0.57527551334844351,0.66844713791649923,0.77012987778947473,{"$f":"AN34/$AN34","v":1}]
[null,null,null,null,null,null,null,null,null,null,null,null,null,null,null,null,null,null,null,null,null,null,null,null,null,null,null,null,null,"η",{"$f":"AE35","v":0.84084008777036401},{"$f":"AF35","v":0.76749642346208879},0.70592127523591131,0.65349249991299219,0.60831308517186633,{"$f":"AJ35","v":0.56897669767582792},0.53441867084104167,0.50381818669671841,0.47653224373778641,0.42996038561058836]
[null,null,null,null,null,null,null,null,null,null,null,null,null,null,null,null,null,null,null,null,null,null,null,null,null,null,null,null,null,null,{"$f":"AE45-$AE$45","v":0},{"$f":"AF45-$AE$45","v":106.70000000000005},{"$f":"AG45-$AE$45","v":213.40000000000009},320.10000000000014,426.80000000000018,533.50000000000023,640.20000000000027,746.90000000000032,853.60000000000036,1067]

{"sheet":"moteurs et mesures","index":3,"n_rows":51,"n_cols":26,"rows_kept":51,"cut":false,"hidden":false,"merged":[]}
["n°","marque du moteur et","type","Ri","Io","Pmax","KV","Imax","Poids",{"$f":"CONCATENATE(\"B\",FIXED((P2-1)*3+1,0),\":O\",FIXED((P2-1)*3+1,0))","v":"B118:O118"}]
[1,"Turnigy AX","2810Q-750Kv",0.11,0.6,444,750,24,70,null,null,null,null,null,"sera copié dans base mesure en n°",{"$f":"MAX('base mesures'!V:V)/3+1","v":40},1,2,3,4,5,6,7,8,9,10]
[2,"Turnigy Multistar","3508 - 380 KV",0.215,0.3,320,380,14,102,null,null,null,"marque","diamètre","pas","RPM",2580,2700,3210,3350,3900,4100,4380]
[3,"AX","4008Q-620KV",0.11,0.3,1000,620,54,88,null,null,null,"RCTimer2",18,4,"traction",625,865,1005,1305,1430,1605,1910]
[4,"Turnigy Multistar","4010 375KV",0.13400000000000001,0.6,450,375,20,128,null,null,null,null,null,null,"P méc",{"$f":"IF(Q7*Q8*Q9>0,(Q9-($N$8*Q7))*(Q7-$N$9),0)","v":34.496499999999997},62.607579622641509,82.795860289855071,115.95968435643566,139.02987050847457,164.49166702702703,212.61771219512198,{"$f":"IF(X7*X8*X9>0,(X9-($N$8*X7))*(X7-$N$9),0)","v":0},0,0]
[5,"Turnigy Multistar","4010-485KV 22 Poles",8.5000000000000006E-2,0.8,500,320,26,128,null,null,null,"moteur n°",8]
[6,"MT","4012 400KV",0.41,0.8,400,350,15.8,144,null,null,null,null,null,{"$f":"IF(VLOOKUP(N$6,A:E,3,0)>\"\",CONCATENATE(VLOOKUP(N$6,A:E,2,0),\" \",VLOOKUP(N$6,A:E,3,0)),\"aucun moteur sous ce n°\")","v":"Turnigy Multistar 4014-320KV 22 Poles"},"I",3.2,5.3,6.9,10.1,11.8,14.8,20.5]
[7,"Tarot ","4014-11 320KV",0.10199999999999999,0.7,720,320,26,163,null,null,null,"Ri",{"$f":"VLOOKUP(N$6,A:E,4,0)","v":0.10199999999999999},null,"P élec",45.2,75,97,135,162,195,263]
[8,"Turnigy Multistar","4014-320KV 22 Poles",0.10199999999999999,0.7,720,320,26,163,null,null,null,"Io",{"$f":"VLOOKUP(N$6,A:E,5,0)","v":0.7},null,"V",{"$f":"IF(Q7=0,0,Q8/Q7)","v":14.125},{"$f":"IF(R7=0,0,R8/R7)","v":14.150943396226415},14.057971014492752,13.366336633663368,13.728813559322033,13.175675675675675,12.829268292682928,0,0,0]
[9,"Turnigy Multistar","4112-320KV 22 Poles",0.17199999999999999,0.5,660,320,20,147]
[10,"Quanum MT Series","4114 340KV",0.12,1.7,560,340,30.3,148]
[11,"Tarot","4114-11 320KV",0.126,1.3,425,320,16.8,148]
[12,"Quanum MT","4212 400KV",0.41,0.8,350,400,15.8,144]
[13,"Turnigy Multistar","4225-390Kv 16 Poles",0.24,0.2,330,390,15,86]
[14,"Turnigy Multistar","4230-400Kv 16 Poles",0.24,0.6,550,400,25,138]
[15,"Turnigy","4260 500KV",1.9E-2,1.36,1000,500,null,278]
[16,"Turnigy Multistar","4822 - 690 KV",5.1999999999999998E-2,0.85,320,390,22,95]
[17,"Turnigy Multistar","4822-390Kv 22 Poles",0.17,0.25,300,390,15,98]
[18,"Turnigy Multistar Elite","5010-274KV",0.12,0.43,630,274,28,211]
[19,"Turnigy","5017 620KV",0.108,1.3,290,620,35,125]
[20,"Turnigy Multistar","5130 - 350 KV",9.9000000000000005E-2,0.5,400,350,16,152]
[21,"ACK","5312CP 330KV",5.1999999999999998E-2,1.5,1000,330,40,250]
[22]
[23]
[24]
[25]
[26]
[27]
[28]
[29]
[30]
[31]
[32]
[33]
[34]
[35]
[36]
[37]
[38]
[39]
[40]
[41]
[42]
[43]
[44]
[45]
[46]
[47]
[48]
[49]
[50]

{"sheet":"base mesures","index":4,"n_rows":600,"n_cols":39,"rows_kept":600,"cut":false,"hidden":false,"merged":[]}
[1,"marque","diamètre","pas","RPM",4162,5151,5742,7143,7914,null,null,null,null,null,"facteur F","exp F","n10N","facteur P","exp P","n100W",{"$f":"IF(SUM(F1:O1)>0,1,0)","v":1},"pour adaptation",null,"Hélice n°",4,null,1]
[null,"RCTimer",13,4,"traction",550,850,1020,1320,1800,null,null,null,null,null,39,1.85,5857,1.6,2.4300000000000002,5700,{"$f":"IF(SUM(F2:O2)>0,1+V1,0)","v":2},"rangée du tableau",null,{"$f":"(Z1-1)*3+1","v":10},null,null,2]
[null,null,null,null,"P méc",53.040527128716398,90.830644389253095,114.77456389091,176.55303129244601,240.176023009537,null,null,null,null,null,null,null,null,null,null,null,{"$f":"IF(SUM(F3:O3)>0,1+V2,0)","v":3},null,null,null,null,null,3]
[2,"marque","diamètre","pas","RPM",4660,5000,6600,null,null,null,null,null,null,null,null,null,null,null,null,null,4,{"$f":"INDEX($A:$O,$Y$2,2)","v":"marque"},{"$f":"INDEX($A:$O,$Y$2,3)","v":"diamètre"},{"$f":"INDEX($A:$O,$Y$2,4)","v":"pas"},null,null,4]
[null,"RCTimer",13,6.5,"traction",850,1000,1700,null,null,null,null,null,null,null,45,"1,92",5100,"1,1","2,8",5100,5,{"$f":"INDEX($A:$O,$Y$2+1,2)","v":"RCTimer"},{"$f":"INDEX($A:$O,$Y$2+1,3)","v":18},{"$f":"INDEX($A:$O,$Y$2+1,4)","v":4},null,null,5]
[null,null,null,null,"P méc",79.966838432900204,112.561823368329,198.17209694614499,null,null,null,null,null,null,null,null,null,null,null,null,null,6,{"$f":"INDEX(C:Q,$Y$2,3)","v":"RPM"},{"$f":"INDEX(C:Q,$Y$2+1,3)","v":"traction"},{"$f":"INDEX(C:Q,$Y$2-1,3)","v":"P méc"},null,null,6]
[3,"marque","diamètre","pas","RPM",5100,5470,6525,7560,null,null,null,null,null,null,null,null,null,null,null,null,7,{"$f":"INDEX($F:$O,$Y$2,AB1)","v":2580},{"$f":"INDEX($F:$O,$Y$2+1,AB1)","v":625},{"$f":"INDEX($F:$O,$Y$2+2,AB1)","v":26.180860000000003},null,null,7]
[null,"RCTimer",14,4.7,"traction",850,1000,1450,1870,null,null,null,null,null,null,39,1.91,5500,2.2000000000000002,2.36,5350,8,{"$f":"INDEX($F:$O,$Y$2,AB2)","v":2700},{"$f":"INDEX($F:$O,$Y$2+1,AB2)","v":865},54.31417358490566,null,null,8]
[null,null,null,null,"P méc",92.574150469222502,112.922141720094,202.33331052751601,257.246861812394,null,null,null,null,null,null,null,null,null,null,null,null,9,3210,1005,74.55151768115941,null,null,9]
[4,"marque","diamètre","pas","RPM",2580,2700,3210,3350,3900,4100,4380,null,null,null,null,null,null,null,null,null,10,3350,1305,108.02472237623762,null,null,10]
[null,"RCTimer",18,4,"traction",625,865,1005,1305,1430,1605,1910,null,null,null,85,"2,11",3200,"2,6","2,95",3450,11,3900,1430,130.77134237288135,null,null,11]
[null,null,null,null,"P méc",26.180860000000003,54.31417358490566,74.55151768115941,108.02472237623762,130.77134237288135,156.29322162162163,203.81315121951221,0,0,0,null,null,null,null,null,null,12,4100,1605,156.29322162162163,null,null,12]
[5,"marque","diamètre","pas","RPM",2340,2760,3000,3840,4200,null,null,null,null,null,null,null,null,null,null,null,13,4380,1910,203.81315121951221]
[null,"HK",18,5.5,"traction",520,780,925,1550,1815,null,null,null,null,null,90,2.11,3150,2.5,3.27,3020,14,0,0,0,null,null,null,{"$f":"IF((AC16*AC17*AC18)>0,1,0)","v":1},{"$f":"IF((AD16*AD17*AD18)>0,1,0)","v":1},1,1,1,1,1,0,0,0,{"$f":"SUM(AC14:AL14)","v":7}]
[null,null,null,null,"P méc",9,62,91,210,277,null,null,null,null,null,null,null,null,null,null,null,15,0,0,0,null,null,null,1,2,3,4,5,6,7,8,9,10]
[6,"marque","diamètre","pas","RPM",5576,9885,15188,17994,null,null,null,null,null,null,null,null,null,null,null,null,16,0,0,0,null,null,null,{"$f":"INDEX($F:$O,$Y$2,AC$15)","v":2580},{"$f":"INDEX($F:$O,$Y$2,AD$15)","v":2700},3210,3350,3900,4100,4380,0,0,0]
[null,"APC Sport",10,6,"traction",449,1409,3320,4656,null,null,null,null,null,null,19,1.9,8450,0.26,2.99,7216,17,null,null,null,null,null,null,{"$f":"INDEX($F:$O,$Y$2+1,AC$15)","v":625},{"$f":"INDEX($F:$O,$Y$2+1,AD$15)","v":865},1005,1305,1430,1605,1910,0,0,0]
[null,null,null,null,"P méc",45.8,254.7,921.5,1530,null,null,null,null,null,null,null,null,null,null,null,null,18,"facteur F","exp F","n10N","facteur P","exp P","n100W",{"$f":"INDEX($F:$O,$Y$2+2,AC$15)","v":26.180860000000003},{"$f":"INDEX($F:$O,$Y$2+2,AD$15)","v":54.31417358490566},74.55151768115941,108.02472237623762,130.77134237288135,156.29322162162163,203.81315121951221,0,0,0]
[7,"marque","diamètre","pas","RPM",6382,7254,7992,9894,null,null,null,null,null,null,null,null,null,null,null,null,19,{"$f":"INDEX($P:$U,$Y$2+1,1)","v":85},{"$f":"INDEX($P:$U,$Y$2+1,2)","v":"2,11"},{"$f":"IF(INDEX($P:$U,$Y$2+1,3)>0,INDEX($P:$U,$Y$2+1,3),$AM$19)","v":3200},{"$f":"INDEX($P:$U,$Y$2+1,4)","v":"2,6"},{"$f":"INDEX($P:$U,$Y$2+1,5)","v":"2,95"},{"$f":"IF(INDEX($P:$U,$Y$2+1,6)>0,INDEX($P:$U,$Y$2+1,6),$AM$20)","v":3450},{"$f":"IF(AC14=1,AC16/(AC17/1019.7)^0.5,0)","v":3295.4589555932871},{"$f":"IF(AD14=1,AD16/(AD17/1019.7)^0.5,0)","v":2931.5136455993616},3233.3908960357958,2961.2546851537154,3293.3114034357577,3268.0037634817436,3200.3217017613088,0,0,0,{"$f":"IF(AM$14>0,SUM(AC19:AL19)/AM$14,SUM(AC19:AL19))","v":3169.0364358658526}]
[null,"APC Sport",10,8,"traction",638,824,1000,1534,null,null,null,null,null,null,16.7,1.97,8030,0.38,2.99,6446,20,null,null,null,null,null,null,{"$f":"IF(AC14=1,AC16/(AC18/100)^(1/3),0)","v":4032.9707281476822},{"$f":"IF(AD14=1,AD16/(AD18/100)^(1/3),0)","v":3309.2230359453806},3540.1326546364248,3264.9040359802857,3566.3755992938977,3532.9471623130389,3454.5915726152775,0,0,0,{"$f":"IF(AM$14>0,SUM(AC20:AL20)/AM$14,SUM(AC20:AL20))","v":3528.7349698474268}]
[null,null,null,null,"P méc",96.4,141.4,189.1,358.9,null,null,null,null,null,null,null,null,null,null,null,null,21,"valeurs trouvées par mes propres mesures"]
[8,"marque","diamètre","pas","RPM",4817,5409,6946,9276,null,null,null,null,null,null,null,null,null,null,null,null,22,"valeurs trouvées dans la base d'hélice de Drive Calculator"]
[null,"APC E",10,10,"traction",434,543,881,1540,null,null,null,null,null,null,18,2,7500,0.6,2.95,5700,23,"valeurs trouvées par simulation dans Drive Calculator"]
[null,null,null,null,"P méc",63.9,89.4,184.6,427,null,null,null,null,null,null,null,null,null,null,null,null,24,"valeurs contradictoires trouvées par simulation dans Drive Calculator"]
[9,"marque","diamètre","pas","RPM",5063,7103,9737,15739,null,null,null,null,null,null,null,null,null,null,null,null,25,{"$f":"W4","v":"marque"},{"$f":"X4","v":"diamètre"},"pas",{"$f":"W18","v":"facteur F"},{"$f":"X18","v":"exp F"},"n10N","facteur P","exp P","n100W"]
[null,"APC Sport",11,5,"traction",501,985,1852,4836,null,null,null,null,null,null,20.5,1.98,7250,0.309,3,6866,26,{"$f":"W5","v":"RCTimer"},18,4,{"$f":"W19","v":85},"2,11",3200,"2,6","2,95",3450]
[null,null,null,null,"P méc",39.9,110,283.3,1195.8,null,null,null,null,null,null,null,null,null,null,null,null,27]
[10,"marque","diamètre","pas","RPM",3513,5207,7239,11789,null,null,null,null,null,null,null,null,null,null,null,null,28]
[null,"APC Sport",11,7,"traction",293,643,1243,3299,null,null,null,null,null,null,23.8,2,6550,0.53219000000000005,3.0009000000000001,5725,29]
[null,null,null,null,"P méc",22.9,74.7,200.5,867.1,null,null,null,null,null,null,null,null,null,null,null,null,30]
[11,"marque","diamètre","pas","RPM",3929,5929,8271,9490,null,null,null,null,null,null,null,null,null,null,null,null,31]
[null,"APC E",11,10,"traction",369,842,1637,2156,null,null,null,null,null,null,23.8,2,6550,0.71209999999999996,3,7216,32]
[null,null,null,null,"P méc",42.5,146.1,396.2,598.79999999999995,null,null,null,null,null,null,null,null,null,null,null,null,33]
[12,"marque","diamètre","pas","RPM",5004,6888,7722,null,null,null,null,null,null,null,null,null,null,null,null,null,34]
[null,"APC E",11,11,"traction",645,1222,1536,null,null,null,null,null,null,null,25.8,2,6300,0.84619999999999995,3,7216,35]
[null,null,null,null,"P méc",105.2,274.39999999999998,386.8,null,null,null,null,null,null,null,null,null,null,null,null,null,36]
[13,"marque","diamètre","pas","RPM",6040,8699,11943,13878,null,null,null,null,null,null,null,null,null,null,null,null,37]
[null,"APC Sport",12,7,"traction",1058,2196,4141,5596,null,null,null,null,null,null,29,2,5940,0.61677760000000004,3.0019830000000001,5447,38]
[null,null,null,null,"P méc",135.30000000000001,404.4,1047.4000000000001,1645.3,null,null,null,null,null,null,null,null,null,null,null,null,39]
[14,"marque","diamètre","pas","RPM",3717,5441,7461,10641,null,null,null,null,null,null,null,null,null,null,null,null,40]
[null,"APC Sport",12,8,"traction",450,963,1811,3683,null,null,null,null,null,null,32.5,2,5600,0.81208360000000002,3,4975,41]
[null,null,null,null,"P méc",41.4,129.9,334.8,971.1,null,null,null,null,null,null,null,null,null,null,null,null,42]
[15,"marque","diamètre","pas","RPM",3734,5546,6683,11234,null,null,null,null,null,null,null,null,null,null,null,null,43]
[null,"APC Sport",12,9,"traction",398,879,1278,3615,null,null,null,null,null,null,28.8,2,5960,0.72424259999999996,3.0050539999999999,5154,44]
[null,null,null,null,"P méc",37.700000000000003,123.6,216.7,1031.3,null,null,null,null,null,null,null,null,null,null,null,null,45]
[16,"marque","diamètre","pas","RPM",4527,6222,8526,14698,null,null,null,null,null,null,null,null,null,null,null,null,46]
[null,"APC Sport",12,10,"traction",670,1268,2383,7091,null,null,null,null,null,null,33,2,5560,0.95800719999999995,3.0062700000000002,4693,47]
[null,null,null,null,"P méc",89.1,231.8,597.29999999999995,3066.6,null,null,null,null,null,null,null,null,null,null,null,null,48]
[17,"marque","diamètre","pas","RPM",4320,6112,8205,13271,null,null,null,null,null,null,null,null,null,null,null,null,49]
[null,"APC E",12,12,"traction",681,1332,2353,5962,null,null,null,null,null,null,34,2,5500,1.528,2.9,4400,50]
[null,null,null,null,"P méc",104.7,286.3,672.1,2710.6,null,null,null,null,null,null,null,null,null,null,null,null,51]
[18,"marque","diamètre","pas","RPM",4787,6520,9165,14411,null,null,null,null,null,null,null,null,null,null,null,null,52]
[null,"APC E",13,6,"traction",784,1456,2876,7112,null,null,null,null,null,null,34,2,5480,0.61,3,5480,53]
[null,null,null,null,"P méc",66.8,169,469.5,1825.4,null,null,null,null,null,null,null,null,null,null,null,null,54]
[19,"marque","diamètre","pas","RPM",4750,6921,9679,14183,null,null,null,null,null,null,null,null,null,null,null,null,55]
[null,"APC Sport",13,6,"traction",810,1722,3366,7222,null,null,null,null,null,null,36,2,5340,0.66108840000000002,2.9994939999999999,5330,56]
[null,null,null,null,"P méc",70.2,217.4,594.29999999999995,1867.7,null,null,null,null,null,null,null,null,null,null,null,null,57]
[20,"marque","diamètre","pas","RPM",4560,6568,9201,14137,null,null,null,null,null,null,null,null,null,null,null,null,58]
[null,"APC Sport",13,8,"traction",806,1668,3268,7698,null,null,null,null,null,null,38.5,2,5150,0.92842639999999999,2.9924469999999999,4800,59]
[null,null,null,null,"P méc",86.4,257.3,705.6,2550.6,null,null,null,null,null,null,null,null,null,null,null,null,60]
[21,"marque","diamètre","pas","RPM",4286,5822,6071,11253,null,null,null,null,null,null,null,null,null,null,null,null,61]
[null,"APC Sport",13,10,"traction",832,1534,1669,5735,null,null,null,null,null,null,45,2,4760,1.3673690000000001,3.0011930000000002,4180,62]
[null,null,null,null,"P méc",107.1,268.10000000000002,304.3,1939,null,null,null,null,null,null,null,null,null,null,null,null,63]
[22,"marque","diamètre","pas","RPM",4020,6203,8926,14040,null,null,null,null,null,null,null,null,null,null,null,null,64]
[null,"APC Sport",13,12,"traction",682,1622,3359,8314,null,null,null,null,null,null,42,2,4925,1.4124399999999999,3,4137,65]
[null,null,null,null,"P méc",91.1,334.4,996.5,3879.7,null,null,null,null,null,null,null,null,null,null,null,null,66]
[23,"marque","diamètre","pas","RPM",3903,5852,8572,14604,null,null,null,null,null,null,null,null,null,null,null,null,{"$f":"IF(SUM(F67:O67)>0,1+V66,0)","v":67}]
[null,"APC Sport",13,13,"traction",717,1545,3190,8759,null,null,null,null,null,null,41.4,2,4980,2.1798000000000002,2.8460999999999999,4100,68]
[null,null,null,null,"P méc",104.4,330.1,979.3,4455.1000000000004,null,null,null,null,null,null,null,null,null,null,null,null,69]
[24,"marque","diamètre","pas","RPM",4087,6083,7900,13532,null,null,null,null,null,null,null,null,null,null,null,null,70]
[null,"APC Sport",14,8,"traction",856,1898,3200,9389,null,null,null,null,null,null,51,2,4470,1.228723,2.999266,4335,71]
[null,null,null,null,"P méc",83.1,274.3,600.4,3017.8,null,null,null,null,null,null,null,null,null,null,null,null,72]
[25,"marque","diamètre","pas","RPM",3908,5616,7998,13335,null,null,null,null,null,null,null,null,null,null,null,null,73]
[null,"APC Sport",14,10,"traction",889,1835,3727,10372,null,null,null,null,null,null,58.4,2,4180,1.748672,3.0022730000000002,3849,74]
[null,null,null,null,"P méc",103.9,308.3,892.1,4142,null,null,null,null,null,null,null,null,null,null,null,null,75]
[26,"marque","diamètre","pas","RPM",3909,5603,7852,11237,null,null,null,null,null,null,null,null,null,null,null,null,76]
[null,"APC E",14,12,"traction",811,1747,3590,7708,null,null,null,null,null,null,48,2.1,4100,1.4,3.18,3600,77]
[null,null,null,null,"P méc",103.8,328.4,966.9,3042.5,null,null,null,null,null,null,null,null,null,null,null,null,{"$f":"IF(SUM(F78:O78)>0,1+V77,0)","v":78}]
[27,"marque","diamètre","pas","RPM",3831,5700,8609,11879,null,null,null,null,null,null,null,null,null,null,null,null,{"$f":"IF(SUM(F79:O79)>0,1+V78,0)","v":79}]
[null,"APC Sport",14,12,"traction",854,1893,4327,8256,null,null,null,null,null,null,58.5,2,4170,1.990297,3.0074939999999999,3678,80]
[null,null,null,null,"P méc",112.2,370.4,1279.8,3372.6,null,null,null,null,null,null,null,null,null,null,null,null,81]
[28,"marque","diamètre","pas","RPM",4020,5699,8321,14599,null,null,null,null,null,null,null,null,null,null,null,null,82]
[null,"APC Sport",14,14,"traction",682,1369,2920,8989,null,null,null,null,null,null,42,2,4920,1.43,2.9935,4150,83]
[null,null,null,null,"P méc",91.1,259.2,807.4,4361.8999999999996,null,null,null,null,null,null,null,null,null,null,null,null,84]
[29,"marque","diamètre","pas","RPM",3994,5634,7695,12317,null,null,null,null,null,null,null,null,null,null,null,null,85]
[null,"APC Sport",15,8,"traction",1009,2122,4164,11504,null,null,null,null,null,null,56,2.12,3700,1.0649999999999999,3.242,3750,86]
[null,null,null,null,"P méc",94.2,287.3,789.8,3627,null,null,null,null,null,null,null,null,null,null,null,null,87]
[30,"marque","diamètre","pas","RPM",3678,5413,7023,9383,null,null,null,null,null,null,null,null,null,null,null,null,88]
[null,"APC E",15,10,"traction",1103,2390,4020,7182,null,null,null,null,null,null,81,2,3550,2.6476000000000002,3,3355,89]
[null,null,null,null,"P méc",127.3,406,885.7,2115.3000000000002,null,null,null,null,null,null,null,null,null,null,null,null,90]
[31,"marque","diamètre","pas","RPM",3815,5443,7597,11355,null,null,null,null,null,null,null,null,null,null,null,null,91]
[null,"APC Sport",15,10,"traction",1024,2088,4076,9122,null,null,null,null,null,null,71,2,3800,2.043809,3.0079750000000001,3645,92]
[null,null,null,null,"P méc",113.8,331.6,904.5,3027.6,null,null,null,null,null,null,null,null,null,null,null,null,93]
[32,"marque","diamètre","pas","RPM",3658,5274,7411,9186,null,null,null,null,null,null,null,null,null,null,null,null,94]
[null,"APC Sport",15,13,"traction",977,2030,4012,6158,null,null,null,null,null,null,73,2,3750,2.66,3,3350,95]
[null,null,null,null,"P méc",129.19999999999999,386.9,1075,2044.8,null,null,null,null,null,null,null,null,null,null,null,null,96]
[33,"marque","diamètre","pas","RPM",3786,6052,7712,11029,null,null,null,null,null,null,null,null,null,null,null,null,97]
[null,"APC Sport",16,8,"traction",1255,3205,5210,10655,null,null,null,null,null,null,88,2,3400,2.1648710000000002,3.0009329999999999,3587,98]
[null,null,null,null,"P méc",116.7,476.5,987.4,2888,null,null,null,null,null,null,null,null,null,null,null,null,99]
[34,"marque","diamètre","pas","RPM",3672,5295,7448,9272,null,null,null,null,null,null,null,null,null,null,null,null,100]
[null,"APC Sport",16,10,"traction",1193,2485,4919,7623,null,null,null,null,null,null,88,2,3400,2.596832,3.0028169999999998,3373,101]
[null,null,null,null,"P méc",128,384.6,1070.8,2066.1,null,null,null,null,null,null,null,null,null,null,null,null,102]
[35,"marque","diamètre","pas","RPM",3009,4264,5788,6995,null,null,null,null,null,null,null,null,null,null,null,null,103]
[null,"APC Sport",16,12,"traction",750,1596,3093,4661,null,null,null,null,null,null,65,2.2000000000000002,3340,2.0588540000000002,3.2480769999999999,3130,104]
[null,null,null,null,"P méc",73.099999999999994,227,612.29999999999995,1132.5,null,null,null,null,null,null,null,null,null,null,null,null,105]
[36,"marque","diamètre","pas","RPM",3050,4345,6133,6582,null,null,null,null,null,null,null,null,null,null,null,null,106]
[null,"APC E",17,8,"traction",821,1801,3867,4523,null,null,null,null,null,null,71,2.2000000000000002,3200,1.40916,3.3264999999999998,3500,107]
[null,null,null,null,"P méc",55.6,180.5,567.9,718.3,null,null,null,null,null,null,null,null,null,null,null,null,108]
[37,"marque","diamètre","pas","RPM",1788,3037,4428,6722,null,null,null,null,null,null,null,null,null,null,null,null,109]
[null,"APC E",17,10,"traction",292,912,2051,5035,null,null,null,null,null,null,76,2.2000000000000002,3100,2.205101,3.2270910000000002,3100,110]
[null,null,null,null,"P méc",13.9,76.900000000000006,259.3,997.5,null,null,null,null,null,null,null,null,null,null,null,null,111]
[38,"marque","diamètre","pas","RPM",1812,2554,5065,6659,null,null,null,null,null,null,null,null,null,null,null,null,112]
[null,"APC Sport",18,6,"traction",364,723,2842,4907,null,null,null,null,null,null,110,2,3040,2.538046,2.9986809999999999,3405,113]
[null,null,null,null,"P méc",15,41.9,326.7,741.3,null,null,null,null,null,null,null,null,null,null,null,null,114]
[39,"marque","diamètre","pas","RPM",1257,2894,4069,6055,null,null,null,null,null,null,null,null,null,null,null,null,115]
[null,"APC E",18,8,"traction",224,1186,2346,5193,null,null,null,null,null,null,142,2,2680,3.6129600000000002,3,3025,116]
[null,null,null,null,"P méc",7.2,88.1,245.1,807.1,null,null,null,null,null,null,null,null,null,null,null,null,117]
[40,"marque","diamètre","pas","RPM",null,null,null,null,null,null,null,null,null,null,null,null,null,null,null,null,0]
[null,null,null,null,"traction",null,null,null,null,null,null,null,null,null,null,null,null,null,null,null,null,0]
[null,null,null,null,"P méc",null,null,null,null,null,null,null,null,null,null,null,null,null,null,null,null,0]
[41,"marque","diamètre","pas","RPM",null,null,null,null,null,null,null,null,null,null,null,null,null,null,null,null,0]
[null,null,null,null,"traction",null,null,null,null,null,null,null,null,null,null,null,null,null,null,null,null,0]
[null,null,null,null,"P méc",null,null,null,null,null,null,null,null,null,null,null,null,null,null,null,null,0]
[42,"marque","diamètre","pas","RPM",null,null,null,null,null,null,null,null,null,null,null,null,null,null,null,null,0]
[null,null,null,null,"traction",null,null,null,null,null,null,null,null,null,null,null,null,null,null,null,null,0]
[null,null,null,null,"P méc",null,null,null,null,null,null,null,null,null,null,null,null,null,null,null,null,0]
[43,"marque","diamètre","pas","RPM",null,null,null,null,null,null,null,null,null,null,null,null,null,null,null,null,0]
[null,null,null,null,"traction",null,null,null,null,null,null,null,null,null,null,null,null,null,null,null,null,0]
[null,null,null,null,"P méc",null,null,null,null,null,null,null,null,null,null,null,null,null,null,null,null,0]
[44,"marque","diamètre","pas","RPM",null,null,null,null,null,null,null,null,null,null,null,null,null,null,null,null,0]
[null,null,null,null,"traction",null,null,null,null,null,null,null,null,null,null,null,null,null,null,null,null,0]
[null,null,null,null,"P méc",null,null,null,null,null,null,null,null,null,null,null,null,null,null,null,null,0]
[45,"marque","diamètre","pas","RPM",null,null,null,null,null,null,null,null,null,null,null,null,null,null,null,null,0]
[null,null,null,null,"traction",null,null,null,null,null,null,null,null,null,null,null,null,null,null,null,null,0]
[null,null,null,null,"P méc",null,null,null,null,null,null,null,null,null,null,null,null,null,null,null,null,0]
[46,"marque","diamètre","pas","RPM",null,null,null,null,null,null,null,null,null,null,null,null,null,null,null,null,0]
[null,null,null,null,"traction",null,null,null,null,null,null,null,null,null,null,null,null,null,null,null,null,0]
[null,null,null,null,"P méc",null,null,null,null,null,null,null,null,null,null,null,null,null,null,null,null,0]
[47,"marque","diamètre","pas","RPM",null,null,null,null,null,null,null,null,null,null,null,null,null,null,null,null,0]
[null,null,null,null,"traction",null,null,null,null,null,null,null,null,null,null,null,null,null,null,null,null,0]
[null,null,null,null,"P méc",null,null,null,null,null,null,null,null,null,null,null,null,null,null,null,null,0]
[48,"marque","diamètre","pas","RPM",null,null,null,null,null,null,null,null,null,null,null,null,null,null,null,null,0]
[null,null,null,null,"traction",null,null,null,null,null,null,null,null,null,null,null,null,null,null,null,null,{"$f":"IF(SUM(F143:O143)>0,1+V142,0)","v":0}]
[null,null,null,null,"P méc",null,null,null,null,null,null,null,null,null,null,null,null,null,null,null,null,0]
[49,"marque","diamètre","pas","RPM",null,null,null,null,null,null,null,null,null,null,null,null,null,null,null,null,0]
[null,null,null,null,"traction",null,null,null,null,null,null,null,null,null,null,null,null,null,null,null,null,0]
[null,null,null,null,"P méc",null,null,null,null,null,null,null,null,null,null,null,null,null,null,null,null,0]
[50,"marque","diamètre","pas","RPM",null,null,null,null,null,null,null,null,null,null,null,null,null,null,null,null,0]
[null,null,null,null,"traction",null,null,null,null,null,null,null,null,null,null,null,null,null,null,null,null,0]
[null,null,null,null,"P méc",null,null,null,null,null,null,null,null,null,null,null,null,null,null,null,null,0]
[51,"marque","diamètre","pas","RPM",null,null,null,null,null,null,null,null,null,null,null,null,null,null,null,null,0]
[null,null,null,null,"traction",null,null,null,null,null,null,null,null,null,null,null,null,null,null,null,null,0]
[null,null,null,null,"P méc",null,null,null,null,null,null,null,null,null,null,null,null,null,null,null,null,0]
[52,"marque","diamètre","pas","RPM",null,null,null,null,null,null,null,null,null,null,null,null,null,null,null,null,0]
[null,null,null,null,"traction",null,null,null,null,null,null,null,null,null,null,null,null,null,null,null,null,0]
[null,null,null,null,"P méc",null,null,null,null,null,null,null,null,null,null,null,null,null,null,null,null,0]
[53,"marque","diamètre","pas","RPM",null,null,null,null,null,null,null,null,null,null,null,null,null,null,null,null,0]
[null,null,null,null,"traction",null,null,null,null,null,null,null,null,null,null,null,null,null,null,null,null,0]
[null,null,null,null,"P méc",null,null,null,null,null,null,null,null,null,null,null,null,null,null,null,null,0]
[54,"marque","diamètre","pas","RPM",null,null,null,null,null,null,null,null,null,null,null,null,null,null,null,null,0]
[null,null,null,null,"traction",null,null,null,null,null,null,null,null,null,null,null,null,null,null,null,null,0]
[null,null,null,null,"P méc",null,null,null,null,null,null,null,null,null,null,null,null,null,null,null,null,0]
[55,"marque","diamètre","pas","RPM",null,null,null,null,null,null,null,null,null,null,null,null,null,null,null,null,0]
[null,null,null,null,"traction",null,null,null,null,null,null,null,null,null,null,null,null,null,null,null,null,0]
[null,null,null,null,"P méc",null,null,null,null,null,null,null,null,null,null,null,null,null,null,null,null,0]
[56,"marque","diamètre","pas","RPM",null,null,null,null,null,null,null,null,null,null,null,null,null,null,null,null,0]
[null,null,null,null,"traction",null,null,null,null,null,null,null,null,null,null,null,null,null,null,null,null,0]
[null,null,null,null,"P méc",null,null,null,null,null,null,null,null,null,null,null,null,null,null,null,null,0]
[57,"marque","diamètre","pas","RPM",null,null,null,null,null,null,null,null,null,null,null,null,null,null,null,null,0]
[null,null,null,null,"traction",null,null,null,null,null,null,null,null,null,null,null,null,null,null,null,null,0]
[null,null,null,null,"P méc",null,null,null,null,null,null,null,null,null,null,null,null,null,null,null,null,0]
[58,"marque","diamètre","pas","RPM",null,null,null,null,null,null,null,null,null,null,null,null,null,null,null,null,0]
[null,null,null,null,"traction",null,null,null,null,null,null,null,null,null,null,null,null,null,null,null,null,0]
[null,null,null,null,"P méc",null,null,null,null,null,null,null,null,null,null,null,null,null,null,null,null,0]
[59,"marque","diamètre","pas","RPM",null,null,null,null,null,null,null,null,null,null,null,null,null,null,null,null,0]
[null,null,null,null,"traction",null,null,null,null,null,null,null,null,null,null,null,null,null,null,null,null,0]
[null,null,null,null,"P méc",null,null,null,null,null,null,null,null,null,null,null,null,null,null,null,null,0]
[60,"marque","diamètre","pas","RPM",null,null,null,null,null,null,null,null,null,null,null,null,null,null,null,null,0]
[null,null,null,null,"traction",null,null,null,null,null,null,null,null,null,null,null,null,null,null,null,null,0]
[null,null,null,null,"P méc",null,null,null,null,null,null,null,null,null,null,null,null,null,null,null,null,0]
[61,"marque","diamètre","pas","RPM",null,null,null,null,null,null,null,null,null,null,null,null,null,null,null,null,0]
[null,null,null,null,"traction",null,null,null,null,null,null,null,null,null,null,null,null,null,null,null,null,0]
[null,null,null,null,"P méc",null,null,null,null,null,null,null,null,null,null,null,null,null,null,null,null,0]
[62,"marque","diamètre","pas","RPM",null,null,null,null,null,null,null,null,null,null,null,null,null,null,null,null,0]
[null,null,null,null,"traction",null,null,null,null,null,null,null,null,null,null,null,null,null,null,null,null,0]
[null,null,null,null,"P méc",null,null,null,null,null,null,null,null,null,null,null,null,null,null,null,null,0]
[63,"marque","diamètre","pas","RPM",null,null,null,null,null,null,null,null,null,null,null,null,null,null,null,null,0]
[null,null,null,null,"traction",null,null,null,null,null,null,null,null,null,null,null,null,null,null,null,null,0]
[null,null,null,null,"P méc",null,null,null,null,null,null,null,null,null,null,null,null,null,null,null,null,0]
[64,"marque","diamètre","pas","RPM",null,null,null,null,null,null,null,null,null,null,null,null,null,null,null,null,0]
[null,null,null,null,"traction",null,null,null,null,null,null,null,null,null,null,null,null,null,null,null,null,0]
[null,null,null,null,"P méc",null,null,null,null,null,null,null,null,null,null,null,null,null,null,null,null,0]
[65,"marque","diamètre","pas","RPM",null,null,null,null,null,null,null,null,null,null,null,null,null,null,null,null,0]
[null,null,null,null,"traction",null,null,null,null,null,null,null,null,null,null,null,null,null,null,null,null,0]
[null,null,null,null,"P méc",null,null,null,null,null,null,null,null,null,null,null,null,null,null,null,null,0]
[66,"marque","diamètre","pas","RPM",null,null,null,null,null,null,null,null,null,null,null,null,null,null,null,null,0]
[null,null,null,null,"traction",null,null,null,null,null,null,null,null,null,null,null,null,null,null,null,null,0]
[null,null,null,null,"P méc",null,null,null,null,null,null,null,null,null,null,null,null,null,null,null,null,0]
[67,"marque","diamètre","pas","RPM",null,null,null,null,null,null,null,null,null,null,null,null,null,null,null,null,0]
[null,null,null,null,"traction",null,null,null,null,null,null,null,null,null,null,null,null,null,null,null,null,0]
[null,null,null,null,"P méc",null,null,null,null,null,null,null,null,null,null,null,null,null,null,null,null,0]
[68,"marque","diamètre","pas","RPM",null,null,null,null,null,null,null,null,null,null,null,null,null,null,null,null,0]
[null,null,null,null,"traction",null,null,null,null,null,null,null,null,null,null,null,null,null,null,null,null,0]
[null,null,null,null,"P méc",null,null,null,null,null,null,null,null,null,null,null,null,null,null,null,null,0]
[69,"marque","diamètre","pas","RPM",null,null,null,null,null,null,null,null,null,null,null,null,null,null,null,null,0]
[null,null,null,null,"traction",null,null,null,null,null,null,null,null,null,null,null,null,null,null,null,null,0]
[null,null,null,null,"P méc",null,null,null,null,null,null,null,null,null,null,null,null,null,null,null,null,{"$f":"IF(SUM(F207:O207)>0,1+V206,0)","v":0}]
[70,"marque","diamètre","pas","RPM",null,null,null,null,null,null,null,null,null,null,null,null,null,null,null,null,0]
[null,null,null,null,"traction",null,null,null,null,null,null,null,null,null,null,null,null,null,null,null,null,0]
[null,null,null,null,"P méc",null,null,null,null,null,null,null,null,null,null,null,null,null,null,null,null,0]
[71,"marque","diamètre","pas","RPM",null,null,null,null,null,null,null,null,null,null,null,null,null,null,null,null,0]
[null,null,null,null,"traction",null,null,null,null,null,null,null,null,null,null,null,null,null,null,null,null,0]
[null,null,null,null,"P méc",null,null,null,null,null,null,null,null,null,null,null,null,null,null,null,null,0]
[72,"marque","diamètre","pas","RPM",null,null,null,null,null,null,null,null,null,null,null,null,null,null,null,null,0]
[null,null,null,null,"traction",null,null,null,null,null,null,null,null,null,null,null,null,null,null,null,null,0]
[null,null,null,null,"P méc",null,null,null,null,null,null,null,null,null,null,null,null,null,null,null,null,0]
[73,"marque","diamètre","pas","RPM",null,null,null,null,null,null,null,null,null,null,null,null,null,null,null,null,0]
[null,null,null,null,"traction",null,null,null,null,null,null,null,null,null,null,null,null,null,null,null,null,0]
[null,null,null,null,"P méc",null,null,null,null,null,null,null,null,null,null,null,null,null,null,null,null,0]
[74,"marque","diamètre","pas","RPM",null,null,null,null,null,null,null,null,null,null,null,null,null,null,null,null,0]
[null,null,null,null,"traction",null,null,null,null,null,null,null,null,null,null,null,null,null,null,null,null,0]
[null,null,null,null,"P méc",null,null,null,null,null,null,null,null,null,null,null,null,null,null,null,null,0]
[75,"marque","diamètre","pas","RPM",null,null,null,null,null,null,null,null,null,null,null,null,null,null,null,null,0]
[null,null,null,null,"traction",null,null,null,null,null,null,null,null,null,null,null,null,null,null,null,null,0]
[null,null,null,null,"P méc",null,null,null,null,null,null,null,null,null,null,null,null,null,null,null,null,0]
[76,"marque","diamètre","pas","RPM",null,null,null,null,null,null,null,null,null,null,null,null,null,null,null,null,0]
[null,null,null,null,"traction",null,null,null,null,null,null,null,null,null,null,null,null,null,null,null,null,0]
[null,null,null,null,"P méc",null,null,null,null,null,null,null,null,null,null,null,null,null,null,null,null,0]
[77,"marque","diamètre","pas","RPM",null,null,null,null,null,null,null,null,null,null,null,null,null,null,null,null,0]
[null,null,null,null,"traction",null,null,null,null,null,null,null,null,null,null,null,null,null,null,null,null,0]
[null,null,null,null,"P méc",null,null,null,null,null,null,null,null,null,null,null,null,null,null,null,null,0]
[78,"marque","diamètre","pas","RPM",null,null,null,null,null,null,null,null,null,null,null,null,null,null,null,null,0]
[null,null,null,null,"traction",null,null,null,null,null,null,null,null,null,null,null,null,null,null,null,null,0]
[null,null,null,null,"P méc",null,null,null,null,null,null,null,null,null,null,null,null,null,null,null,null,0]
[79,"marque","diamètre","pas","RPM",null,null,null,null,null,null,null,null,null,null,null,null,null,null,null,null,0]
[null,null,null,null,"traction",null,null,null,null,null,null,null,null,null,null,null,null,null,null,null,null,0]
[null,null,null,null,"P méc",null,null,null,null,null,null,null,null,null,null,null,null,null,null,null,null,0]
[80,"marque","diamètre","pas","RPM",null,null,null,null,null,null,null,null,null,null,null,null,null,null,null,null,0]
[null,null,null,null,"traction",null,null,null,null,null,null,null,null,null,null,null,null,null,null,null,null,0]
[null,null,null,null,"P méc",null,null,null,null,null,null,null,null,null,null,null,null,null,null,null,null,0]
[81,"marque","diamètre","pas","RPM",null,null,null,null,null,null,null,null,null,null,null,null,null,null,null,null,0]
[null,null,null,null,"traction",null,null,null,null,null,null,null,null,null,null,null,null,null,null,null,null,0]
[null,null,null,null,"P méc",null,null,null,null,null,null,null,null,null,null,null,null,null,null,null,null,0]
[82,"marque","diamètre","pas","RPM",null,null,null,null,null,null,null,null,null,null,null,null,null,null,null,null,0]
[null,null,null,null,"traction",null,null,null,null,null,null,null,null,null,null,null,null,null,null,null,null,0]
[null,null,null,null,"P méc",null,null,null,null,null,null,null,null,null,null,null,null,null,null,null,null,0]
[83,"marque","diamètre","pas","RPM",null,null,null,null,null,null,null,null,null,null,null,null,null,null,null,null,0]
[null,null,null,null,"traction",null,null,null,null,null,null,null,null,null,null,null,null,null,null,null,null,0]
[null,null,null,null,"P méc",null,null,null,null,null,null,null,null,null,null,null,null,null,null,null,null,0]
[84,"marque","diamètre","pas","RPM",null,null,null,null,null,null,null,null,null,null,null,null,null,null,null,null,0]
[null,null,null,null,"traction",null,null,null,null,null,null,null,null,null,null,null,null,null,null,null,null,0]
[null,null,null,null,"P méc",null,null,null,null,null,null,null,null,null,null,null,null,null,null,null,null,0]
[85,"marque","diamètre","pas","RPM",null,null,null,null,null,null,null,null,null,null,null,null,null,null,null,null,0]
[null,null,null,null,"traction",null,null,null,null,null,null,null,null,null,null,null,null,null,null,null,null,0]
[null,null,null,null,"P méc",null,null,null,null,null,null,null,null,null,null,null,null,null,null,null,null,0]
[86,"marque","diamètre","pas","RPM",null,null,null,null,null,null,null,null,null,null,null,null,null,null,null,null,0]
[null,null,null,null,"traction",null,null,null,null,null,null,null,null,null,null,null,null,null,null,null,null,0]
[null,null,null,null,"P méc",null,null,null,null,null,null,null,null,null,null,null,null,null,null,null,null,0]
[87,"marque","diamètre","pas","RPM",null,null,null,null,null,null,null,null,null,null,null,null,null,null,null,null,0]
[null,null,null,null,"traction",null,null,null,null,null,null,null,null,null,null,null,null,null,null,null,null,0]
[null,null,null,null,"P méc",null,null,null,null,null,null,null,null,null,null,null,null,null,null,null,null,0]
[88,"marque","diamètre","pas","RPM",null,null,null,null,null,null,null,null,null,null,null,null,null,null,null,null,0]
[null,null,null,null,"traction",null,null,null,null,null,null,null,null,null,null,null,null,null,null,null,null,0]
[null,null,null,null,"P méc",null,null,null,null,null,null,null,null,null,null,null,null,null,null,null,null,0]
[89,"marque","diamètre","pas","RPM",null,null,null,null,null,null,null,null,null,null,null,null,null,null,null,null,0]
[null,null,null,null,"traction",null,null,null,null,null,null,null,null,null,null,null,null,null,null,null,null,0]
[null,null,null,null,"P méc",null,null,null,null,null,null,null,null,null,null,null,null,null,null,null,null,0]
[90,"marque","diamètre","pas","RPM",null,null,null,null,null,null,null,null,null,null,null,null,null,null,null,null,0]
[null,null,null,null,"traction",null,null,null,null,null,null,null,null,null,null,null,null,null,null,null,null,0]
[null,null,null,null,"P méc",null,null,null,null,null,null,null,null,null,null,null,null,null,null,null,null,0]
[91,"marque","diamètre","pas","RPM",null,null,null,null,null,null,null,null,null,null,null,null,null,null,null,null,{"$f":"IF(SUM(F271:O271)>0,1+V270,0)","v":0}]
[null,null,null,null,"traction",null,null,null,null,null,null,null,null,null,null,null,null,null,null,null,null,0]
[null,null,null,null,"P méc",null,null,null,null,null,null,null,null,null,null,null,null,null,null,null,null,0]
[92,"marque","diamètre","pas","RPM",null,null,null,null,null,null,null,null,null,null,null,null,null,null,null,null,0]
[null,null,null,null,"traction",null,null,null,null,null,null,null,null,null,null,null,null,null,null,null,null,0]
[null,null,null,null,"P méc",null,null,null,null,null,null,null,null,null,null,null,null,null,null,null,null,0]
[93,"marque","diamètre","pas","RPM",null,null,null,null,null,null,null,null,null,null,null,null,null,null,null,null,0]
[null,null,null,null,"traction",null,null,null,null,null,null,null,null,null,null,null,null,null,null,null,null,0]
[null,null,null,null,"P méc",null,null,null,null,null,null,null,null,null,null,null,null,null,null,null,null,0]
[94,"marque","diamètre","pas","RPM",null,null,null,null,null,null,null,null,null,null,null,null,null,null,null,null,0]
[null,null,null,null,"traction",null,null,null,null,null,null,null,null,null,null,null,null,null,null,null,null,0]
[null,null,null,null,"P méc",null,null,null,null,null,null,null,null,null,null,null,null,null,null,null,null,0]
[95,"marque","diamètre","pas","RPM",null,null,null,null,null,null,null,null,null,null,null,null,null,null,null,null,0]
[null,null,null,null,"traction",null,null,null,null,null,null,null,null,null,null,null,null,null,null,null,null,0]
[null,null,null,null,"P méc",null,null,null,null,null,null,null,null,null,null,null,null,null,null,null,null,0]
[96,"marque","diamètre","pas","RPM",null,null,null,null,null,null,null,null,null,null,null,null,null,null,null,null,0]
[null,null,null,null,"traction",null,null,null,null,null,null,null,null,null,null,null,null,null,null,null,null,0]
[null,null,null,null,"P méc",null,null,null,null,null,null,null,null,null,null,null,null,null,null,null,null,0]
[97,"marque","diamètre","pas","RPM",null,null,null,null,null,null,null,null,null,null,null,null,null,null,null,null,0]
[null,null,null,null,"traction",null,null,null,null,null,null,null,null,null,null,null,null,null,null,null,null,0]
[null,null,null,null,"P méc",null,null,null,null,null,null,null,null,null,null,null,null,null,null,null,null,0]
[98,"marque","diamètre","pas","RPM",null,null,null,null,null,null,null,null,null,null,null,null,null,null,null,null,0]
[null,null,null,null,"traction",null,null,null,null,null,null,null,null,null,null,null,null,null,null,null,null,0]
[null,null,null,null,"P méc",null,null,null,null,null,null,null,null,null,null,null,null,null,null,null,null,0]
[99,"marque","diamètre","pas","RPM",null,null,null,null,null,null,null,null,null,null,null,null,null,null,null,null,0]
[null,null,null,null,"traction",null,null,null,null,null,null,null,null,null,null,null,null,null,null,null,null,0]
[null,null,null,null,"P méc",null,null,null,null,null,null,null,null,null,null,null,null,null,null,null,null,0]
[100,"marque","diamètre","pas","RPM",null,null,null,null,null,null,null,null,null,null,null,null,null,null,null,null,0]
[null,null,null,null,"traction",null,null,null,null,null,null,null,null,null,null,null,null,null,null,null,null,0]
[null,null,null,null,"P méc",null,null,null,null,null,null,null,null,null,null,null,null,null,null,null,null,0]
[101,"marque","diamètre","pas","RPM",null,null,null,null,null,null,null,null,null,null,null,null,null,null,null,null,0]
[null,null,null,null,"traction",null,null,null,null,null,null,null,null,null,null,null,null,null,null,null,null,0]
[null,null,null,null,"P méc",null,null,null,null,null,null,null,null,null,null,null,null,null,null,null,null,0]
[102,"marque","diamètre","pas","RPM",null,null,null,null,null,null,null,null,null,null,null,null,null,null,null,null,0]
[null,null,null,null,"traction",null,null,null,null,null,null,null,null,null,null,null,null,null,null,null,null,0]
[null,null,null,null,"P méc",null,null,null,null,null,null,null,null,null,null,null,null,null,null,null,null,0]
[103,"marque","diamètre","pas","RPM",null,null,null,null,null,null,null,null,null,null,null,null,null,null,null,null,0]
[null,null,null,null,"traction",null,null,null,null,null,null,null,null,null,null,null,null,null,null,null,null,0]
[null,null,null,null,"P méc",null,null,null,null,null,null,null,null,null,null,null,null,null,null,null,null,0]
[104,"marque","diamètre","pas","RPM",null,null,null,null,null,null,null,null,null,null,null,null,null,null,null,null,0]
[null,null,null,null,"traction",null,null,null,null,null,null,null,null,null,null,null,null,null,null,null,null,0]
[null,null,null,null,"P méc",null,null,null,null,null,null,null,null,null,null,null,null,null,null,null,null,0]
[105,"marque","diamètre","pas","RPM",null,null,null,null,null,null,null,null,null,null,null,null,null,null,null,null,0]
[null,null,null,null,"traction",null,null,null,null,null,null,null,null,null,null,null,null,null,null,null,null,0]
[null,null,null,null,"P méc",null,null,null,null,null,null,null,null,null,null,null,null,null,null,null,null,0]
[106,"marque","diamètre","pas","RPM",null,null,null,null,null,null,null,null,null,null,null,null,null,null,null,null,0]
[null,null,null,null,"traction",null,null,null,null,null,null,null,null,null,null,null,null,null,null,null,null,0]
[null,null,null,null,"P méc",null,null,null,null,null,null,null,null,null,null,null,null,null,null,null,null,0]
[107,"marque","diamètre","pas","RPM",null,null,null,null,null,null,null,null,null,null,null,null,null,null,null,null,0]
[null,null,null,null,"traction",null,null,null,null,null,null,null,null,null,null,null,null,null,null,null,null,0]
[null,null,null,null,"P méc",null,null,null,null,null,null,null,null,null,null,null,null,null,null,null,null,0]
[108,"marque","diamètre","pas","RPM",null,null,null,null,null,null,null,null,null,null,null,null,null,null,null,null,0]
[null,null,null,null,"traction",null,null,null,null,null,null,null,null,null,null,null,null,null,null,null,null,0]
[null,null,null,null,"P méc",null,null,null,null,null,null,null,null,null,null,null,null,null,null,null,null,0]
[109,"marque","diamètre","pas","RPM",null,null,null,null,null,null,null,null,null,null,null,null,null,null,null,null,0]
[null,null,null,null,"traction",null,null,null,null,null,null,null,null,null,null,null,null,null,null,null,null,0]
[null,null,null,null,"P méc",null,null,null,null,null,null,null,null,null,null,null,null,null,null,null,null,0]
[110,"marque","diamètre","pas","RPM",null,null,null,null,null,null,null,null,null,null,null,null,null,null,null,null,0]
[null,null,null,null,"traction",null,null,null,null,null,null,null,null,null,null,null,null,null,null,null,null,0]
[null,null,null,null,"P méc",null,null,null,null,null,null,null,null,null,null,null,null,null,null,null,null,0]
[111,"marque","diamètre","pas","RPM",null,null,null,null,null,null,null,null,null,null,null,null,null,null,null,null,0]
[null,null,null,null,"traction",null,null,null,null,null,null,null,null,null,null,null,null,null,null,null,null,0]
[null,null,null,null,"P méc",null,null,null,null,null,null,null,null,null,null,null,null,null,null,null,null,0]
[112,"marque","diamètre","pas","RPM",null,null,null,null,null,null,null,null,null,null,null,null,null,null,null,null,0]
[null,null,null,null,"traction",null,null,null,null,null,null,null,null,null,null,null,null,null,null,null,null,{"$f":"IF(SUM(F335:O335)>0,1+V334,0)","v":0}]
[null,null,null,null,"P méc",null,null,null,null,null,null,null,null,null,null,null,null,null,null,null,null,0]
[113,"marque","diamètre","pas","RPM",null,null,null,null,null,null,null,null,null,null,null,null,null,null,null,null,0]
[null,null,null,null,"traction",null,null,null,null,null,null,null,null,null,null,null,null,null,null,null,null,0]
[null,null,null,null,"P méc",null,null,null,null,null,null,null,null,null,null,null,null,null,null,null,null,0]
[114,"marque","diamètre","pas","RPM",null,null,null,null,null,null,null,null,null,null,null,null,null,null,null,null,0]
[null,null,null,null,"traction",null,null,null,null,null,null,null,null,null,null,null,null,null,null,null,null,0]
[null,null,null,null,"P méc",null,null,null,null,null,null,null,null,null,null,null,null,null,null,null,null,0]
[115,"marque","diamètre","pas","RPM",null,null,null,null,null,null,null,null,null,null,null,null,null,null,null,null,0]
[null,null,null,null,"traction",null,null,null,null,null,null,null,null,null,null,null,null,null,null,null,null,0]
[null,null,null,null,"P méc",null,null,null,null,null,null,null,null,null,null,null,null,null,null,null,null,0]
[116,"marque","diamètre","pas","RPM",null,null,null,null,null,null,null,null,null,null,null,null,null,null,null,null,0]
[null,null,null,null,"traction",null,null,null,null,null,null,null,null,null,null,null,null,null,null,null,null,0]
[null,null,null,null,"P méc",null,null,null,null,null,null,null,null,null,null,null,null,null,null,null,null,0]
[117,"marque","diamètre","pas","RPM",null,null,null,null,null,null,null,null,null,null,null,null,null,null,null,null,0]
[null,null,null,null,"traction",null,null,null,null,null,null,null,null,null,null,null,null,null,null,null,null,0]
[null,null,null,null,"P méc",null,null,null,null,null,null,null,null,null,null,null,null,null,null,null,null,0]
[118,"marque","diamètre","pas","RPM",null,null,null,null,null,null,null,null,null,null,null,null,null,null,null,null,0]
[null,null,null,null,"traction",null,null,null,null,null,null,null,null,null,null,null,null,null,null,null,null,0]
[null,null,null,null,"P méc",null,null,null,null,null,null,null,null,null,null,null,null,null,null,null,null,0]
[119,"marque","diamètre","pas","RPM",null,null,null,null,null,null,null,null,null,null,null,null,null,null,null,null,0]
[null,null,null,null,"traction",null,null,null,null,null,null,null,null,null,null,null,null,null,null,null,null,0]
[null,null,null,null,"P méc",null,null,null,null,null,null,null,null,null,null,null,null,null,null,null,null,0]
[120,"marque","diamètre","pas","RPM",null,null,null,null,null,null,null,null,null,null,null,null,null,null,null,null,0]
[null,null,null,null,"traction",null,null,null,null,null,null,null,null,null,null,null,null,null,null,null,null,0]
[null,null,null,null,"P méc",null,null,null,null,null,null,null,null,null,null,null,null,null,null,null,null,0]
[121,"marque","diamètre","pas","RPM",null,null,null,null,null,null,null,null,null,null,null,null,null,null,null,null,0]
[null,null,null,null,"traction",null,null,null,null,null,null,null,null,null,null,null,null,null,null,null,null,0]
[null,null,null,null,"P méc",null,null,null,null,null,null,null,null,null,null,null,null,null,null,null,null,0]
[122,"marque","diamètre","pas","RPM",null,null,null,null,null,null,null,null,null,null,null,null,null,null,null,null,0]
[null,null,null,null,"traction",null,null,null,null,null,null,null,null,null,null,null,null,null,null,null,null,0]
[null,null,null,null,"P méc",null,null,null,null,null,null,null,null,null,null,null,null,null,null,null,null,0]
[123,"marque","diamètre","pas","RPM",null,null,null,null,null,null,null,null,null,null,null,null,null,null,null,null,0]
[null,null,null,null,"traction",null,null,null,null,null,null,null,null,null,null,null,null,null,null,null,null,0]
[null,null,null,null,"P méc",null,null,null,null,null,null,null,null,null,null,null,null,null,null,null,null,0]
[124,"marque","diamètre","pas","RPM",null,null,null,null,null,null,null,null,null,null,null,null,null,null,null,null,0]
[null,null,null,null,"traction",null,null,null,null,null,null,null,null,null,null,null,null,null,null,null,null,0]
[null,null,null,null,"P méc",null,null,null,null,null,null,null,null,null,null,null,null,null,null,null,null,0]
[125,"marque","diamètre","pas","RPM",null,null,null,null,null,null,null,null,null,null,null,null,null,null,null,null,0]
[null,null,null,null,"traction",null,null,null,null,null,null,null,null,null,null,null,null,null,null,null,null,0]
[null,null,null,null,"P méc",null,null,null,null,null,null,null,null,null,null,null,null,null,null,null,null,0]
[126,"marque","diamètre","pas","RPM",null,null,null,null,null,null,null,null,null,null,null,null,null,null,null,null,0]
[null,null,null,null,"traction",null,null,null,null,null,null,null,null,null,null,null,null,null,null,null,null,0]
[null,null,null,null,"P méc",null,null,null,null,null,null,null,null,null,null,null,null,null,null,null,null,0]
[127,"marque","diamètre","pas","RPM",null,null,null,null,null,null,null,null,null,null,null,null,null,null,null,null,0]
[null,null,null,null,"traction",null,null,null,null,null,null,null,null,null,null,null,null,null,null,null,null,0]
[null,null,null,null,"P méc",null,null,null,null,null,null,null,null,null,null,null,null,null,null,null,null,0]
[128,"marque","diamètre","pas","RPM",null,null,null,null,null,null,null,null,null,null,null,null,null,null,null,null,0]
[null,null,null,null,"traction",null,null,null,null,null,null,null,null,null,null,null,null,null,null,null,null,0]
[null,null,null,null,"P méc",null,null,null,null,null,null,null,null,null,null,null,null,null,null,null,null,0]
[129,"marque","diamètre","pas","RPM",null,null,null,null,null,null,null,null,null,null,null,null,null,null,null,null,0]
[null,null,null,null,"traction",null,null,null,null,null,null,null,null,null,null,null,null,null,null,null,null,0]
[null,null,null,null,"P méc",null,null,null,null,null,null,null,null,null,null,null,null,null,null,null,null,0]
[130,"marque","diamètre","pas","RPM",null,null,null,null,null,null,null,null,null,null,null,null,null,null,null,null,0]
[null,null,null,null,"traction",null,null,null,null,null,null,null,null,null,null,null,null,null,null,null,null,0]
[null,null,null,null,"P méc",null,null,null,null,null,null,null,null,null,null,null,null,null,null,null,null,0]
[131,"marque","diamètre","pas","RPM",null,null,null,null,null,null,null,null,null,null,null,null,null,null,null,null,0]
[null,null,null,null,"traction",null,null,null,null,null,null,null,null,null,null,null,null,null,null,null,null,0]
[null,null,null,null,"P méc",null,null,null,null,null,null,null,null,null,null,null,null,null,null,null,null,0]
[132,"marque","diamètre","pas","RPM",null,null,null,null,null,null,null,null,null,null,null,null,null,null,null,null,0]
[null,null,null,null,"traction",null,null,null,null,null,null,null,null,null,null,null,null,null,null,null,null,0]
[null,null,null,null,"P méc",null,null,null,null,null,null,null,null,null,null,null,null,null,null,null,null,0]
[133,"marque","diamètre","pas","RPM",null,null,null,null,null,null,null,null,null,null,null,null,null,null,null,null,0]
[null,null,null,null,"traction",null,null,null,null,null,null,null,null,null,null,null,null,null,null,null,null,0]
[null,null,null,null,"P méc",null,null,null,null,null,null,null,null,null,null,null,null,null,null,null,null,{"$f":"IF(SUM(F399:O399)>0,1+V398,0)","v":0}]
[134,"marque","diamètre","pas","RPM",null,null,null,null,null,null,null,null,null,null,null,null,null,null,null,null,0]
[null,null,null,null,"traction",null,null,null,null,null,null,null,null,null,null,null,null,null,null,null,null,0]
[null,null,null,null,"P méc",null,null,null,null,null,null,null,null,null,null,null,null,null,null,null,null,0]
[135,"marque","diamètre","pas","RPM",null,null,null,null,null,null,null,null,null,null,null,null,null,null,null,null,0]
[null,null,null,null,"traction",null,null,null,null,null,null,null,null,null,null,null,null,null,null,null,null,0]
[null,null,null,null,"P méc",null,null,null,null,null,null,null,null,null,null,null,null,null,null,null,null,0]
[136,"marque","diamètre","pas","RPM",null,null,null,null,null,null,null,null,null,null,null,null,null,null,null,null,0]
[null,null,null,null,"traction",null,null,null,null,null,null,null,null,null,null,null,null,null,null,null,null,0]
[null,null,null,null,"P méc",null,null,null,null,null,null,null,null,null,null,null,null,null,null,null,null,0]
[137,"marque","diamètre","pas","RPM",null,null,null,null,null,null,null,null,null,null,null,null,null,null,null,null,0]
[null,null,null,null,"traction",null,null,null,null,null,null,null,null,null,null,null,null,null,null,null,null,0]
[null,null,null,null,"P méc",null,null,null,null,null,null,null,null,null,null,null,null,null,null,null,null,0]
[138,"marque","diamètre","pas","RPM",null,null,null,null,null,null,null,null,null,null,null,null,null,null,null,null,0]
[null,null,null,null,"traction",null,null,null,null,null,null,null,null,null,null,null,null,null,null,null,null,0]
[null,null,null,null,"P méc",null,null,null,null,null,null,null,null,null,null,null,null,null,null,null,null,0]
[139,"marque","diamètre","pas","RPM",null,null,null,null,null,null,null,null,null,null,null,null,null,null,null,null,0]
[null,null,null,null,"traction",null,null,null,null,null,null,null,null,null,null,null,null,null,null,null,null,0]
[null,null,null,null,"P méc",null,null,null,null,null,null,null,null,null,null,null,null,null,null,null,null,0]
[140,"marque","diamètre","pas","RPM",null,null,null,null,null,null,null,null,null,null,null,null,null,null,null,null,0]
[null,null,null,null,"traction",null,null,null,null,null,null,null,null,null,null,null,null,null,null,null,null,0]
[null,null,null,null,"P méc",null,null,null,null,null,null,null,null,null,null,null,null,null,null,null,null,0]
[141,"marque","diamètre","pas","RPM",null,null,null,null,null,null,null,null,null,null,null,null,null,null,null,null,0]
[null,null,null,null,"traction",null,null,null,null,null,null,null,null,null,null,null,null,null,null,null,null,0]
[null,null,null,null,"P méc",null,null,null,null,null,null,null,null,null,null,null,null,null,null,null,null,0]
[142,"marque","diamètre","pas","RPM",null,null,null,null,null,null,null,null,null,null,null,null,null,null,null,null,0]
[null,null,null,null,"traction",null,null,null,null,null,null,null,null,null,null,null,null,null,null,null,null,0]
[null,null,null,null,"P méc",null,null,null,null,null,null,null,null,null,null,null,null,null,null,null,null,0]
[143,"marque","diamètre","pas","RPM",null,null,null,null,null,null,null,null,null,null,null,null,null,null,null,null,0]
[null,null,null,null,"traction",null,null,null,null,null,null,null,null,null,null,null,null,null,null,null,null,0]
[null,null,null,null,"P méc",null,null,null,null,null,null,null,null,null,null,null,null,null,null,null,null,0]
[144,"marque","diamètre","pas","RPM",null,null,null,null,null,null,null,null,null,null,null,null,null,null,null,null,0]
[null,null,null,null,"traction",null,null,null,null,null,null,null,null,null,null,null,null,null,null,null,null,0]
[null,null,null,null,"P méc",null,null,null,null,null,null,null,null,null,null,null,null,null,null,null,null,0]
[145,"marque","diamètre","pas","RPM",null,null,null,null,null,null,null,null,null,null,null,null,null,null,null,null,0]
[null,null,null,null,"traction",null,null,null,null,null,null,null,null,null,null,null,null,null,null,null,null,0]
[null,null,null,null,"P méc",null,null,null,null,null,null,null,null,null,null,null,null,null,null,null,null,0]
[146,"marque","diamètre","pas","RPM",null,null,null,null,null,null,null,null,null,null,null,null,null,null,null,null,0]
[null,null,null,null,"traction",null,null,null,null,null,null,null,null,null,null,null,null,null,null,null,null,0]
[null,null,null,null,"P méc",null,null,null,null,null,null,null,null,null,null,null,null,null,null,null,null,0]
[147,"marque","diamètre","pas","RPM",null,null,null,null,null,null,null,null,null,null,null,null,null,null,null,null,0]
[null,null,null,null,"traction",null,null,null,null,null,null,null,null,null,null,null,null,null,null,null,null,0]
[null,null,null,null,"P méc",null,null,null,null,null,null,null,null,null,null,null,null,null,null,null,null,0]
[148,"marque","diamètre","pas","RPM",null,null,null,null,null,null,null,null,null,null,null,null,null,null,null,null,0]
[null,null,null,null,"traction",null,null,null,null,null,null,null,null,null,null,null,null,null,null,null,null,0]
[null,null,null,null,"P méc",null,null,null,null,null,null,null,null,null,null,null,null,null,null,null,null,0]
[149,"marque","diamètre","pas","RPM",null,null,null,null,null,null,null,null,null,null,null,null,null,null,null,null,0]
[null,null,null,null,"traction",null,null,null,null,null,null,null,null,null,null,null,null,null,null,null,null,0]
[null,null,null,null,"P méc",null,null,null,null,null,null,null,null,null,null,null,null,null,null,null,null,0]
[150,"marque","diamètre","pas","RPM",null,null,null,null,null,null,null,null,null,null,null,null,null,null,null,null,0]
[null,null,null,null,"traction",null,null,null,null,null,null,null,null,null,null,null,null,null,null,null,null,0]
[null,null,null,null,"P méc",null,null,null,null,null,null,null,null,null,null,null,null,null,null,null,null,0]
[151,"marque","diamètre","pas","RPM",null,null,null,null,null,null,null,null,null,null,null,null,null,null,null,null,0]
[null,null,null,null,"traction",null,null,null,null,null,null,null,null,null,null,null,null,null,null,null,null,0]
[null,null,null,null,"P méc",null,null,null,null,null,null,null,null,null,null,null,null,null,null,null,null,0]
[152,"marque","diamètre","pas","RPM",null,null,null,null,null,null,null,null,null,null,null,null,null,null,null,null,0]
[null,null,null,null,"traction",null,null,null,null,null,null,null,null,null,null,null,null,null,null,null,null,0]
[null,null,null,null,"P méc",null,null,null,null,null,null,null,null,null,null,null,null,null,null,null,null,0]
[153,"marque","diamètre","pas","RPM",null,null,null,null,null,null,null,null,null,null,null,null,null,null,null,null,0]
[null,null,null,null,"traction",null,null,null,null,null,null,null,null,null,null,null,null,null,null,null,null,0]
[null,null,null,null,"P méc",null,null,null,null,null,null,null,null,null,null,null,null,null,null,null,null,0]
[154,"marque","diamètre","pas","RPM",null,null,null,null,null,null,null,null,null,null,null,null,null,null,null,null,0]
[null,null,null,null,"traction",null,null,null,null,null,null,null,null,null,null,null,null,null,null,null,null,0]
[null,null,null,null,"P méc",null,null,null,null,null,null,null,null,null,null,null,null,null,null,null,null,0]
[155,"marque","diamètre","pas","RPM",null,null,null,null,null,null,null,null,null,null,null,null,null,null,null,null,{"$f":"IF(SUM(F463:O463)>0,1+V462,0)","v":0}]
[null,null,null,null,"traction",null,null,null,null,null,null,null,null,null,null,null,null,null,null,null,null,0]
[null,null,null,null,"P méc",null,null,null,null,null,null,null,null,null,null,null,null,null,null,null,null,0]
[156,"marque","diamètre","pas","RPM",null,null,null,null,null,null,null,null,null,null,null,null,null,null,null,null,0]
[null,null,null,null,"traction",null,null,null,null,null,null,null,null,null,null,null,null,null,null,null,null,0]
[null,null,null,null,"P méc",null,null,null,null,null,null,null,null,null,null,null,null,null,null,null,null,0]
[157,"marque","diamètre","pas","RPM",null,null,null,null,null,null,null,null,null,null,null,null,null,null,null,null,0]
[null,null,null,null,"traction",null,null,null,null,null,null,null,null,null,null,null,null,null,null,null,null,0]
[null,null,null,null,"P méc",null,null,null,null,null,null,null,null,null,null,null,null,null,null,null,null,0]
[158,"marque","diamètre","pas","RPM",null,null,null,null,null,null,null,null,null,null,null,null,null,null,null,null,0]
[null,null,null,null,"traction",null,null,null,null,null,null,null,null,null,null,null,null,null,null,null,null,0]
[null,null,null,null,"P méc",null,null,null,null,null,null,null,null,null,null,null,null,null,null,null,null,0]
[159,"marque","diamètre","pas","RPM",null,null,null,null,null,null,null,null,null,null,null,null,null,null,null,null,0]
[null,null,null,null,"traction",null,null,null,null,null,null,null,null,null,null,null,null,null,null,null,null,0]
[null,null,null,null,"P méc",null,null,null,null,null,null,null,null,null,null,null,null,null,null,null,null,0]
[160,"marque","diamètre","pas","RPM",null,null,null,null,null,null,null,null,null,null,null,null,null,null,null,null,0]
[null,null,null,null,"traction",null,null,null,null,null,null,null,null,null,null,null,null,null,null,null,null,0]
[null,null,null,null,"P méc",null,null,null,null,null,null,null,null,null,null,null,null,null,null,null,null,0]
[161,"marque","diamètre","pas","RPM",null,null,null,null,null,null,null,null,null,null,null,null,null,null,null,null,0]
[null,null,null,null,"traction",null,null,null,null,null,null,null,null,null,null,null,null,null,null,null,null,0]
[null,null,null,null,"P méc",null,null,null,null,null,null,null,null,null,null,null,null,null,null,null,null,0]
[162,"marque","diamètre","pas","RPM",null,null,null,null,null,null,null,null,null,null,null,null,null,null,null,null,0]
[null,null,null,null,"traction",null,null,null,null,null,null,null,null,null,null,null,null,null,null,null,null,0]
[null,null,null,null,"P méc",null,null,null,null,null,null,null,null,null,null,null,null,null,null,null,null,0]
[163,"marque","diamètre","pas","RPM",null,null,null,null,null,null,null,null,null,null,null,null,null,null,null,null,0]
[null,null,null,null,"traction",null,null,null,null,null,null,null,null,null,null,null,null,null,null,null,null,0]
[null,null,null,null,"P méc",null,null,null,null,null,null,null,null,null,null,null,null,null,null,null,null,0]
[164,"marque","diamètre","pas","RPM",null,null,null,null,null,null,null,null,null,null,null,null,null,null,null,null,0]
[null,null,null,null,"traction",null,null,null,null,null,null,null,null,null,null,null,null,null,null,null,null,0]
[null,null,null,null,"P méc",null,null,null,null,null,null,null,null,null,null,null,null,null,null,null,null,0]
[165,"marque","diamètre","pas","RPM",null,null,null,null,null,null,null,null,null,null,null,null,null,null,null,null,0]
[null,null,null,null,"traction",null,null,null,null,null,null,null,null,null,null,null,null,null,null,null,null,0]
[null,null,null,null,"P méc",null,null,null,null,null,null,null,null,null,null,null,null,null,null,null,null,0]
[166,"marque","diamètre","pas","RPM",null,null,null,null,null,null,null,null,null,null,null,null,null,null,null,null,0]
[null,null,null,null,"traction",null,null,null,null,null,null,null,null,null,null,null,null,null,null,null,null,0]
[null,null,null,null,"P méc",null,null,null,null,null,null,null,null,null,null,null,null,null,null,null,null,0]
[167,"marque","diamètre","pas","RPM",null,null,null,null,null,null,null,null,null,null,null,null,null,null,null,null,0]
[null,null,null,null,"traction",null,null,null,null,null,null,null,null,null,null,null,null,null,null,null,null,0]
[null,null,null,null,"P méc",null,null,null,null,null,null,null,null,null,null,null,null,null,null,null,null,0]
[168,"marque","diamètre","pas","RPM",null,null,null,null,null,null,null,null,null,null,null,null,null,null,null,null,0]
[null,null,null,null,"traction",null,null,null,null,null,null,null,null,null,null,null,null,null,null,null,null,0]
[null,null,null,null,"P méc",null,null,null,null,null,null,null,null,null,null,null,null,null,null,null,null,0]
[169,"marque","diamètre","pas","RPM",null,null,null,null,null,null,null,null,null,null,null,null,null,null,null,null,0]
[null,null,null,null,"traction",null,null,null,null,null,null,null,null,null,null,null,null,null,null,null,null,0]
[null,null,null,null,"P méc",null,null,null,null,null,null,null,null,null,null,null,null,null,null,null,null,0]
[170,"marque","diamètre","pas","RPM",null,null,null,null,null,null,null,null,null,null,null,null,null,null,null,null,0]
[null,null,null,null,"traction",null,null,null,null,null,null,null,null,null,null,null,null,null,null,null,null,0]
[null,null,null,null,"P méc",null,null,null,null,null,null,null,null,null,null,null,null,null,null,null,null,0]
[171,"marque","diamètre","pas","RPM",null,null,null,null,null,null,null,null,null,null,null,null,null,null,null,null,0]
[null,null,null,null,"traction",null,null,null,null,null,null,null,null,null,null,null,null,null,null,null,null,0]
[null,null,null,null,"P méc",null,null,null,null,null,null,null,null,null,null,null,null,null,null,null,null,0]
[172,"marque","diamètre","pas","RPM",null,null,null,null,null,null,null,null,null,null,null,null,null,null,null,null,0]
[null,null,null,null,"traction",null,null,null,null,null,null,null,null,null,null,null,null,null,null,null,null,0]
[null,null,null,null,"P méc",null,null,null,null,null,null,null,null,null,null,null,null,null,null,null,null,0]
[173,"marque","diamètre","pas","RPM",null,null,null,null,null,null,null,null,null,null,null,null,null,null,null,null,0]
[null,null,null,null,"traction",null,null,null,null,null,null,null,null,null,null,null,null,null,null,null,null,0]
[null,null,null,null,"P méc",null,null,null,null,null,null,null,null,null,null,null,null,null,null,null,null,0]
[174,"marque","diamètre","pas","RPM",null,null,null,null,null,null,null,null,null,null,null,null,null,null,null,null,0]
[null,null,null,null,"traction",null,null,null,null,null,null,null,null,null,null,null,null,null,null,null,null,0]
[null,null,null,null,"P méc",null,null,null,null,null,null,null,null,null,null,null,null,null,null,null,null,0]
[175,"marque","diamètre","pas","RPM",null,null,null,null,null,null,null,null,null,null,null,null,null,null,null,null,0]
[null,null,null,null,"traction",null,null,null,null,null,null,null,null,null,null,null,null,null,null,null,null,0]
[null,null,null,null,"P méc",null,null,null,null,null,null,null,null,null,null,null,null,null,null,null,null,0]
[176,"marque","diamètre","pas","RPM",null,null,null,null,null,null,null,null,null,null,null,null,null,null,null,null,0]
[null,null,null,null,"traction",null,null,null,null,null,null,null,null,null,null,null,null,null,null,null,null,{"$f":"IF(SUM(F527:O527)>0,1+V526,0)","v":0}]
[null,null,null,null,"P méc",null,null,null,null,null,null,null,null,null,null,null,null,null,null,null,null,0]
[177,"marque","diamètre","pas","RPM",null,null,null,null,null,null,null,null,null,null,null,null,null,null,null,null,0]
[null,null,null,null,"traction",null,null,null,null,null,null,null,null,null,null,null,null,null,null,null,null,0]
[null,null,null,null,"P méc",null,null,null,null,null,null,null,null,null,null,null,null,null,null,null,null,0]
[178,"marque","diamètre","pas","RPM",null,null,null,null,null,null,null,null,null,null,null,null,null,null,null,null,0]
[null,null,null,null,"traction",null,null,null,null,null,null,null,null,null,null,null,null,null,null,null,null,0]
[null,null,null,null,"P méc",null,null,null,null,null,null,null,null,null,null,null,null,null,null,null,null,0]
[179,"marque","diamètre","pas","RPM",null,null,null,null,null,null,null,null,null,null,null,null,null,null,null,null,0]
[null,null,null,null,"traction",null,null,null,null,null,null,null,null,null,null,null,null,null,null,null,null,0]
[null,null,null,null,"P méc",null,null,null,null,null,null,null,null,null,null,null,null,null,null,null,null,0]
[180,"marque","diamètre","pas","RPM",null,null,null,null,null,null,null,null,null,null,null,null,null,null,null,null,0]
[null,null,null,null,"traction",null,null,null,null,null,null,null,null,null,null,null,null,null,null,null,null,0]
[null,null,null,null,"P méc",null,null,null,null,null,null,null,null,null,null,null,null,null,null,null,null,0]
[181,"marque","diamètre","pas","RPM",null,null,null,null,null,null,null,null,null,null,null,null,null,null,null,null,0]
[null,null,null,null,"traction",null,null,null,null,null,null,null,null,null,null,null,null,null,null,null,null,0]
[null,null,null,null,"P méc",null,null,null,null,null,null,null,null,null,null,null,null,null,null,null,null,0]
[182,"marque","diamètre","pas","RPM",null,null,null,null,null,null,null,null,null,null,null,null,null,null,null,null,0]
[null,null,null,null,"traction",null,null,null,null,null,null,null,null,null,null,null,null,null,null,null,null,0]
[null,null,null,null,"P méc",null,null,null,null,null,null,null,null,null,null,null,null,null,null,null,null,0]
[183,"marque","diamètre","pas","RPM",null,null,null,null,null,null,null,null,null,null,null,null,null,null,null,null,0]
[null,null,null,null,"traction",null,null,null,null,null,null,null,null,null,null,null,null,null,null,null,null,0]
[null,null,null,null,"P méc",null,null,null,null,null,null,null,null,null,null,null,null,null,null,null,null,0]
[184,"marque","diamètre","pas","RPM",null,null,null,null,null,null,null,null,null,null,null,null,null,null,null,null,0]
[null,null,null,null,"traction",null,null,null,null,null,null,null,null,null,null,null,null,null,null,null,null,0]
[null,null,null,null,"P méc",null,null,null,null,null,null,null,null,null,null,null,null,null,null,null,null,0]
[185,"marque","diamètre","pas","RPM",null,null,null,null,null,null,null,null,null,null,null,null,null,null,null,null,0]
[null,null,null,null,"traction",null,null,null,null,null,null,null,null,null,null,null,null,null,null,null,null,0]
[null,null,null,null,"P méc",null,null,null,null,null,null,null,null,null,null,null,null,null,null,null,null,0]
[186,"marque","diamètre","pas","RPM",null,null,null,null,null,null,null,null,null,null,null,null,null,null,null,null,0]
[null,null,null,null,"traction",null,null,null,null,null,null,null,null,null,null,null,null,null,null,null,null,0]
[null,null,null,null,"P méc",null,null,null,null,null,null,null,null,null,null,null,null,null,null,null,null,0]
[187,"marque","diamètre","pas","RPM",null,null,null,null,null,null,null,null,null,null,null,null,null,null,null,null,0]
[null,null,null,null,"traction",null,null,null,null,null,null,null,null,null,null,null,null,null,null,null,null,0]
[null,null,null,null,"P méc",null,null,null,null,null,null,null,null,null,null,null,null,null,null,null,null,0]
[188,"marque","diamètre","pas","RPM",null,null,null,null,null,null,null,null,null,null,null,null,null,null,null,null,0]
[null,null,null,null,"traction",null,null,null,null,null,null,null,null,null,null,null,null,null,null,null,null,0]
[null,null,null,null,"P méc",null,null,null,null,null,null,null,null,null,null,null,null,null,null,null,null,0]
[189,"marque","diamètre","pas","RPM",null,null,null,null,null,null,null,null,null,null,null,null,null,null,null,null,0]
[null,null,null,null,"traction",null,null,null,null,null,null,null,null,null,null,null,null,null,null,null,null,0]
[null,null,null,null,"P méc",null,null,null,null,null,null,null,null,null,null,null,null,null,null,null,null,0]
[190,"marque","diamètre","pas","RPM",null,null,null,null,null,null,null,null,null,null,null,null,null,null,null,null,0]
[null,null,null,null,"traction",null,null,null,null,null,null,null,null,null,null,null,null,null,null,null,null,0]
[null,null,null,null,"P méc",null,null,null,null,null,null,null,null,null,null,null,null,null,null,null,null,0]
[191,"marque","diamètre","pas","RPM",null,null,null,null,null,null,null,null,null,null,null,null,null,null,null,null,0]
[null,null,null,null,"traction",null,null,null,null,null,null,null,null,null,null,null,null,null,null,null,null,0]
[null,null,null,null,"P méc",null,null,null,null,null,null,null,null,null,null,null,null,null,null,null,null,0]
[192,"marque","diamètre","pas","RPM",null,null,null,null,null,null,null,null,null,null,null,null,null,null,null,null,0]
[null,null,null,null,"traction",null,null,null,null,null,null,null,null,null,null,null,null,null,null,null,null,0]
[null,null,null,null,"P méc",null,null,null,null,null,null,null,null,null,null,null,null,null,null,null,null,0]
[193,"marque","diamètre","pas","RPM",null,null,null,null,null,null,null,null,null,null,null,null,null,null,null,null,0]
[null,null,null,null,"traction",null,null,null,null,null,null,null,null,null,null,null,null,null,null,null,null,0]
[null,null,null,null,"P méc",null,null,null,null,null,null,null,null,null,null,null,null,null,null,null,null,0]
[194,"marque","diamètre","pas","RPM",null,null,null,null,null,null,null,null,null,null,null,null,null,null,null,null,0]
[null,null,null,null,"traction",null,null,null,null,null,null,null,null,null,null,null,null,null,null,null,null,0]
[null,null,null,null,"P méc",null,null,null,null,null,null,null,null,null,null,null,null,null,null,null,null,0]
[195,"marque","diamètre","pas","RPM",null,null,null,null,null,null,null,null,null,null,null,null,null,null,null,null,0]
[null,null,null,null,"traction",null,null,null,null,null,null,null,null,null,null,null,null,null,null,null,null,0]
[null,null,null,null,"P méc",null,null,null,null,null,null,null,null,null,null,null,null,null,null,null,null,0]
[196,"marque","diamètre","pas","RPM",null,null,null,null,null,null,null,null,null,null,null,null,null,null,null,null,0]
[null,null,null,null,"traction",null,null,null,null,null,null,null,null,null,null,null,null,null,null,null,null,0]
[null,null,null,null,"P méc",null,null,null,null,null,null,null,null,null,null,null,null,null,null,null,null,0]
[197,"marque","diamètre","pas","RPM",null,null,null,null,null,null,null,null,null,null,null,null,null,null,null,null,0]
[null,null,null,null,"traction",null,null,null,null,null,null,null,null,null,null,null,null,null,null,null,null,0]
[null,null,null,null,"P méc",null,null,null,null,null,null,null,null,null,null,null,null,null,null,null,null,{"$f":"IF(SUM(F591:O591)>0,1+V590,0)","v":0}]
[198,"marque","diamètre","pas","RPM",null,null,null,null,null,null,null,null,null,null,null,null,null,null,null,null,0]
[null,null,null,null,"traction",null,null,null,null,null,null,null,null,null,null,null,null,null,null,null,null,0]
[null,null,null,null,"P méc",null,null,null,null,null,null,null,null,null,null,null,null,null,null,null,null,0]
[199,"marque","diamètre","pas","RPM",null,null,null,null,null,null,null,null,null,null,null,null,null,null,null,null,0]
[null,null,null,null,"traction",null,null,null,null,null,null,null,null,null,null,null,null,null,null,null,null,0]
[null,null,null,null,"P méc",null,null,null,null,null,null,null,null,null,null,null,null,null,null,null,null,0]
[200,"marque","diamètre","pas","RPM",null,null,null,null,null,null,null,null,null,null,null,null,null,null,null,null,0]
[null,null,null,null,"traction",null,null,null,null,null,null,null,null,null,null,null,null,null,null,null,null,0]
[null,null,null,null,"P méc",null,null,null,null,null,null,null,null,null,null,null,null,null,null,null,null,0]

{"sheet":"adaptation","index":5,"n_rows":55,"n_cols":20,"rows_kept":55,"cut":false,"hidden":false,"merged":[]}
[null,"mesures",{"$f":"'base mesures'!Y1","v":"Hélice n°"},{"$f":"'base mesures'!Z1","v":4},null,null,null,"calcul pour",null,null,null,"adaptation:"]
[null,null,{"$f":"'base mesures'!W5","v":"RCTimer"},{"$f":"'base mesures'!X5","v":18},{"$f":"'base mesures'!Y5","v":4},null,null,"l'adaptation","selon","selon",null,"modifiez les facteurs et exposants en"]
[null,null,null,null,null,null,"pour","pour","n10N ","n100W",null,"commencant par ces valeurs de départ"]
[null,null,null,null,null,null,"exp=2","exp=3",{"$f":"M6","v":3200},{"$f":"P6","v":3450},{"$f":"G6","v":93.89459768042785},2,{"$f":"'base mesures'!AM19","v":3169.0364358658526},{"$f":"H6","v":1.5244907389938644},3,{"$f":"'base mesures'!AM20","v":3528.7349698474268}]
[null,"RPM","F","P méc","n10N","n100W","facteur F","facteur P","F","P méc","facteur F","exp F","n10N","facteur P","exp P","n100W","F","P méc","n10N","n100W"]
[1,{"$f":"'base mesures'!W7","v":2580},{"$f":"'base mesures'!X7","v":625},{"$f":"'base mesures'!Y7","v":26.180860000000003},{"$f":"IF(B6*C6>0,B6*(10/(9.80665*C6/1000))^0.5,0)","v":3295.4851539805259},{"$f":"IF(B6*D6>0,B6*(100/D6)^(1/3),0)","v":4032.9707281476822},{"$f":"IF(B6*C6>0,C6/(B6/1000)^2,0)","v":93.89459768042785},{"$f":"IF(B6*D6>0,D6/(B6/1000)^3,0)","v":1.5244907389938644},{"$f":"IF($I$4>0,(B6/$I$4)^2/0.000980665,0)","v":662.8553711002229},{"$f":"IF($J$4>0,(B6/$J$4)^3*100,0)","v":41.821714473576073},85,2.11,3200,2.6,2.95,3450,{"$f":"IF(B6*$K$6*$L$6>0,$K$6*(B6/1000)^$L$6,0)","v":627.96654216402169},{"$f":"IF(B6*$N$6*$O$6>0,$N$6*(B6/1000)^$O$6,0)","v":42.58449295570064},{"$f":"IF(B6*Q6>0,B6*(10/(9.80665*Q6/1000))^0.5,0)","v":3287.6919292208258},{"$f":"IF(B6*R6>0,B6*(100/R6)^(1/3),0)","v":3429.2768348757841}]
[2,{"$f":"IF('base mesures'!W8>0,'base mesures'!W8,B6)","v":2700},{"$f":"IF('base mesures'!X8>0,'base mesures'!X8,C6)","v":865},{"$f":"IF('base mesures'!Y8>0,'base mesures'!Y8,D6)","v":54.31417358490566},{"$f":"IF(B7*C7>0,B7*(10/(9.80665*C7/1000))^0.5,0)","v":2931.5369506778707},{"$f":"IF(B7*D7>0,B7*(100/D7)^(1/3),0)","v":3309.2230359453802},{"$f":"IF(B7*C7>0,C7/(B7/1000)^2,0)","v":118.65569272976678},2.7594458967081059,{"$f":"IF($I$4>0,(B7/$I$4)^2/0.000980665,0)","v":725.95031177823216},{"$f":"IF($J$4>0,(B7/$J$4)^3*100,0)","v":47.932933344291946},null,{"$f":"IF(SUM(K10:P10)>0,\"valeurs déjà dans la base de mesures\",\"pas de valeurs dans la base de mesures\")","v":"valeurs déjà dans la base de mesures"},null,null,null,null,{"$f":"IF(B7*$K$6*$L$6>0,$K$6*(B7/1000)^$L$6,0)","v":691.18844326867327},48.696354713481519,{"$f":"IF(B7*Q7>0,B7*(10/(9.80665*Q7/1000))^0.5,0)","v":3279.4815528181821},3431.8762039685039]
[3,{"$f":"IF('base mesures'!W9>0,'base mesures'!W9,B7)","v":3210},{"$f":"IF('base mesures'!X9>0,'base mesures'!X9,C7)","v":1005},{"$f":"IF('base mesures'!Y9>0,'base mesures'!Y9,D7)","v":74.55151768115941},3233.4166009915939,3540.1326546364253,97.53399132384196,2.2539350223007868,1026.0993974751827,80.548565792717994,null,"(moyenne pour n10N et n100W)",null,null,null,null,995.73676836079414,81.126584757620833,3248.4218464866781,3441.7868257001946]
[4,{"$f":"IF('base mesures'!W10>0,'base mesures'!W10,B8)","v":3350},{"$f":"IF('base mesures'!X10>0,'base mesures'!X10,C8)","v":1305},{"$f":"IF('base mesures'!Y10>0,'base mesures'!Y10,D8)","v":108.02472237623762},2961.2782266688723,3264.9040359802857,116.28425038984183,2.8733513730409022,1117.5551953266406,91.553960469880579,{"$f":"'base mesures'!W18","v":"facteur F"},{"$f":"'base mesures'!X18","v":"exp F"},{"$f":"'base mesures'!Y18","v":"n10N"},{"$f":"'base mesures'!Z18","v":"facteur P"},{"$f":"'base mesures'!AA18","v":"exp P"},{"$f":"'base mesures'!AB18","v":"n100W"},1089.5909027617367,92.01434283207756,3240.803766867491,3444.2364944618398]
[5,{"$f":"IF('base mesures'!W11>0,'base mesures'!W11,B9)","v":3900},{"$f":"IF('base mesures'!X11>0,'base mesures'!X11,C9)","v":1430},{"$f":"IF('base mesures'!Y11>0,'base mesures'!Y11,D9)","v":130.77134237288135},3293.3375847502898,3566.3755992938973,94.017094017094024,2.2045439466761301,1514.6370702533486,144.45631626530778,{"$f":"'base mesures'!W19","v":85},{"$f":"'base mesures'!X19","v":"2,11"},{"$f":"'base mesures'!Y19","v":3200},{"$f":"'base mesures'!Z19","v":"2,6"},{"$f":"'base mesures'!AA19","v":"2,95"},{"$f":"'base mesures'!AB19","v":3450},1501.6379884590572,144.08339685711979,3213.8207168809072,3452.9738878150761]
[6,{"$f":"IF('base mesures'!W12>0,'base mesures'!W12,B10)","v":4100},{"$f":"IF('base mesures'!X12>0,'base mesures'!X12,C10)","v":1605},{"$f":"IF('base mesures'!Y12>0,'base mesures'!Y12,D10)","v":156.29322162162163},{"$f":"IF(B11*C11>0,B11*(10/(9.80665*C11/1000))^0.5,0)","v":3268.0297436044666},3532.9471623130389,95.478881618084486,2.2677155238841809,1673.96772853115,167.83954168683351,null,null,null,null,null,null,1668.7560890636046,166.98817766283017,3204.993014153833,3455.8531655368465]
[7,{"$f":"IF('base mesures'!W13>0,'base mesures'!W13,B11)","v":4380},{"$f":"IF('base mesures'!X13>0,'base mesures'!X13,C11)","v":1910},{"$f":"IF('base mesures'!Y13>0,'base mesures'!Y13,D11)","v":203.81315121951221},3200.347143822145,3454.5915726152775,99.560059214778676,2.4255479935170907,1910.4144254154069,204.6279937535958,null,null,null,null,null,null,1918.3564157448925,202.91865449766146,3193.3691343041282,3459.6602561812169]
[8,{"$f":"IF('base mesures'!W14>0,'base mesures'!W14,B12)","v":4380},{"$f":"IF('base mesures'!X14>0,'base mesures'!X14,C12)","v":1910},{"$f":"IF('base mesures'!Y14>0,'base mesures'!Y14,D12)","v":203.81315121951221},3200.347143822145,3454.5915726152775,99.560059214778676,2.4255479935170907,1910.4144254154069,204.6279937535958,null,null,null,null,null,null,1918.3564157448925,202.91865449766146,3193.3691343041282,3459.6602561812169]
[9,{"$f":"IF('base mesures'!W15>0,'base mesures'!W15,B13)","v":4380},{"$f":"IF('base mesures'!X15>0,'base mesures'!X15,C13)","v":1910},{"$f":"IF('base mesures'!Y15>0,'base mesures'!Y15,D13)","v":203.81315121951221},3200.347143822145,3454.5915726152775,99.560059214778676,2.4255479935170907,1910.4144254154069,204.6279937535958,null,null,null,null,null,null,1918.3564157448925,202.91865449766146,3193.3691343041282,3459.6602561812169]
[10,{"$f":"IF('base mesures'!W16>0,'base mesures'!W16,B14)","v":4380},{"$f":"IF('base mesures'!X16>0,'base mesures'!X16,C14)","v":1910},{"$f":"IF('base mesures'!Y16>0,'base mesures'!Y16,D14)","v":203.81315121951221},3200.347143822145,3454.5915726152775,99.560059214778676,2.4255479935170907,1910.4144254154069,204.6279937535958,null,null,null,null,null,null,1918.3564157448925,202.91865449766146,3193.3691343041282,3459.6602561812169]
[11,{"$f":"IF('base mesures'!W17>0,'base mesures'!W17,B15)","v":4380},{"$f":"IF('base mesures'!X17>0,'base mesures'!X17,C15)","v":1910},{"$f":"IF('base mesures'!Y17>0,'base mesures'!Y17,D15)","v":203.81315121951221},3200.347143822145,3454.5915726152775,99.560059214778676,2.4255479935170907,1910.4144254154069,204.6279937535958,null,null,null,null,null,null,1918.3564157448925,202.91865449766146,{"$f":"IF(B16*Q16>0,B16*(10/(9.80665*Q16/1000))^0.5,0)","v":3193.3691343041282},3459.6602561812169]
[]
[null,null,null,null,null,null,"F = facteur * (rpm/1000)^exposant (grs)"]
[null,null,null,null,null,null,"P = facteur * (rpm/1000)^exposant (watts)"]
[null,null,"traction",null,null,null,null,null,null,null,null,"puissance mécanique"]
[]
[]
[]
[]
[]
[]
[]
[]
[]
[]
[]
[]
[]
[]
[]
[]
[]
[]
[]
[]
[]
[]
[]
[]
[]
[]
[]
[]
[]
[]
[]
[null,"position"]
[null,{"$f":"CONCATENATE(\"P\",FIXED('base mesures'!Y2+1,0,0),\":U\",FIXED('base mesures'!Y2+1,0,0))","v":"P11:U11"},null,"valeurs à copier pour la base mesures"]
[null,null,null,"Attention collage spécial (valeurs)"]
[null,null,{"$f":"K6","v":85},{"$f":"L6","v":2.11},{"$f":"I4","v":3200},{"$f":"N6","v":2.6},{"$f":"O6","v":2.95},{"$f":"J4","v":3450}]

{"sheet":"test hélices","index":6,"n_rows":88,"n_cols":49,"rows_kept":88,"cut":false,"hidden":false,"merged":[]}
["diamètre hélice conseillé",null,null,{"$f":"taille!E6","v":18}]
[null,null,null,null,null,null,null,null,"Utiliser le moteur de moteurs et mesures n°",8,null,null,null,null,"gamme des forces de traction",null,null,null,null,null,{"$f":"IF(V2*X2>0,CONCATENATE(B11,\" - \",F10),\"\")","v":"Hélice n°1 - 1"},{"$f":"C13","v":13},{"$f":"IF(V2*X2>0,\"x\",\"\")","v":"x"},{"$f":"C14","v":4},{"$f":"E20","v":8.647803285614895},{"$f":"IF(Y2>0,\"grs/watt\",\"\")","v":"grs/watt"},null,null,null,{"$f":"IF(Y2=MAX($Y$2,$Y$3,$Y$4,$Y$5,$Y$6,$Y$7),CONCATENATE(\" à \",FIXED(E18,0),\" trs/min, meilleure hélice\"),CONCATENATE(\" à \",FIXED(E18,0),\" trs/min                                \"))","v":" à 5.969 trs/min                                "}]
[null,null,null,null,"moteur de test",null,null,"P",{"$f":"INDEX('moteurs et mesures'!F:M,'test hélices'!$J$2+1,1)","v":720},"watts",null,{"$f":"'moteur test'!G10","v":1063},{"$f":"($Q$3-$L$3)/5+L3","v":1276.4000000000001},{"$f":"($Q$3-$L$3)/5+M3","v":1489.8000000000002},{"$f":"($Q$3-$L$3)/5+N3","v":1703.2000000000003},{"$f":"($Q$3-$L$3)/5+O3","v":1916.6000000000004},{"$f":"'moteur test'!G16","v":2130},"grs",null,null,{"$f":"IF(V3*X3>0,CONCATENATE(B24,\" - \",F23),\"\")","v":"Hélice n°2 - 2"},{"$f":"C26","v":13},"x",{"$f":"C27","v":6.5},{"$f":"E33","v":9.6024300281120993},"grs/watt",null,null,null,{"$f":"IF(Y3=MAX($Y$2,$Y$3,$Y$4,$Y$5,$Y$6,$Y$7),CONCATENATE(\" à \",FIXED(E31,0),\" trs/min, meilleure hélice\"),CONCATENATE(\" à \",FIXED(E31,0),\" trs/min                                \"))","v":" à 5.191 trs/min                                "}]
[null,null,null,null,{"$f":"INDEX('moteurs et mesures'!B:I,'test hélices'!$J$2+1,1)","v":"Turnigy Multistar"},null,null,"KV",{"$f":"INDEX('moteurs et mesures'!G:N,'test hélices'!$J$2+1,1)","v":320},null,null,null,null,null,null,null,null,null,null,null,{"$f":"IF(V4*X4>0,CONCATENATE(B37,\" - \",F36),\"\")","v":"Hélice n°3 - 3"},{"$f":"C39","v":14},"x",{"$f":"C40","v":4.7},{"$f":"E46","v":8.1365913430340253},"grs/watt",null,null,null,{"$f":"IF(Y4=MAX($Y$2,$Y$3,$Y$4,$Y$5,$Y$6,$Y$7),CONCATENATE(\" à \",FIXED(E44,0),\" trs/min, meilleure hélice\"),CONCATENATE(\" à \",FIXED(E44,0),\" trs/min                                \"))","v":" à 5.644 trs/min                                "}]
[null,null,null,null,{"$f":"INDEX('moteurs et mesures'!C:J,'test hélices'!$J$2+1,1)","v":"4014-320KV 22 Poles"},null,null,"ri",{"$f":"INDEX('moteurs et mesures'!D:K,'test hélices'!$J$2+1,1)","v":0.10199999999999999},"ohm",null,null,null,null,null,null,null,null,null,null,{"$f":"IF(V5*X5>0,CONCATENATE(B50,\" - \",F49),\"\")","v":"Hélice n°4 - 4"},{"$f":"C52","v":18},"x",{"$f":"C53","v":4},{"$f":"E59","v":11.958581834687742},"grs/watt",null,null,null,{"$f":"IF(Y5=MAX($Y$2,$Y$3,$Y$4,$Y$5,$Y$6,$Y$7),CONCATENATE(\" à \",FIXED(E57,0),\" trs/min, meilleure hélice\"),CONCATENATE(\" à \",FIXED(E57,0),\" trs/min                                \"))","v":" à 3.311 trs/min, meilleure hélice"}]
[null,null,null,null,null,null,null,"I0",{"$f":"INDEX('moteurs et mesures'!E:L,'test hélices'!$J$2+1,1)","v":0.7},"ampère(s)",null,null,null,null,null,null,null,null,null,null,{"$f":"IF(V6*X6>0,CONCATENATE(B63,\" - \",F62),\"\")","v":"Hélice n°5 - 5"},{"$f":"C65","v":18},"x",{"$f":"C66","v":5.5},{"$f":"E72","v":9.2639602478494201},"grs/watt",null,null,null,{"$f":"IF(Y6=MAX($Y$2,$Y$3,$Y$4,$Y$5,$Y$6,$Y$7),CONCATENATE(\" à \",FIXED(E70,0),\" trs/min, meilleure hélice\"),CONCATENATE(\" à \",FIXED(E70,0),\" trs/min                                \"))","v":" à 3.223 trs/min                                "}]
[null,null,null,null,null,null,null,null,null,null,null,null,null,null,null,null,null,null,null,null,{"$f":"IF(V7*X7>0,CONCATENATE(B76,\" - \",F75),\"\")","v":""},{"$f":"C78","v":0},"",{"$f":"C79","v":0},{"$f":"E85","v":""},"grs/watt",null,null,null,{"$f":"IF(Y7=MAX($Y$2,$Y$3,$Y$4,$Y$5,$Y$6,$Y$7),CONCATENATE(\" à \",FIXED(E83,0),\" trs/min, meilleure hélice\"),CONCATENATE(\" à \",FIXED(E83,0),\" trs/min                                \"))","v":" à 0 trs/min                                "},null,null,null,null,null,"vitesse de rotation selon traction (n10N, n100W et formule)"]
[]
[null,null,null,null,null,null,null,null,null,null,null,null,null,null,null,null,null,"Puissances en fonction de RPM",null,null,null,null,null,null,null,"efficacités en fonction de RPM"]
[null,null,null,null,"Hélice de base mesure n°",1]
[null,"Hélice n°1",null,null,null,"F = kf x (n / 1000)exp_f",null,null,null,null,{"$f":"CONCATENATE(\"traction vol stationnaire: \",FIXED('moteur test'!G$10,0),\" grs / \",\" traction maximale: \",FIXED('moteur test'!G$16,0),\" grs = \",FIXED('moteur test'!G$15,1))","v":"traction vol stationnaire: 1.063 grs /  traction maximale: 2.130 grs = 2,0"}]
[null,"marque",{"$f":"IF($F10>0,INDEX('base mesures'!A:U,'test hélices'!F10*3-1,2),\"\")","v":"RCTimer"},null,null,"P = kp x (n / 1000)exp_p",null,"traction",{"$f":"$L$3","v":1063},{"$f":"I12+($N$12-$I$12)/5","v":1276.4000000000001},{"$f":"J12+($N$12-$I$12)/5","v":1489.8000000000002},{"$f":"K12+($N$12-$I$12)/5","v":1703.2000000000003},{"$f":"L12+($N$12-$I$12)/5","v":1916.6000000000004},{"$f":"$Q$3","v":2130},"grs",null,null,null,null,null,null,null,null,null,null,null,null,null,null,null,null,null,null,null,null,null,null,null,null,null,null,null,{"$f":"I12","v":1063},{"$f":"J12","v":1276.4000000000001},1489.8000000000002,1703.2000000000003,1916.6000000000004,2130,"traction"]
[null,"diamètre",{"$f":"IF($F10>0,INDEX('base mesures'!A:U,'test hélices'!F10*3-1,3),0)","v":13},null," kf",{"$f":"IF($F10>0,INDEX('base mesures'!A:U,'test hélices'!F10*3-1,16),0)","v":39},null,"vitesse",{"$f":"IF($F13*$F14>0,(I12/$F13)^(1/$F14)*1000,0)","v":5969.3769468864848},{"$f":"IF($F13*$F14>0,(J12/$F13)^(1/$F14)*1000,0)","v":6589.8701730167268},{"$f":"IF($F13*$F14>0,(K12/$F13)^(1/$F14)*1000,0)","v":7164.2277794979236},{"$f":"IF($F13*$F14>0,(L12/$F13)^(1/$F14)*1000,0)","v":7701.85179818089},{"$f":"IF($F13*$F14>0,(M12/$F13)^(1/$F14)*1000,0)","v":8209.3055404624374},{"$f":"IF($F13*$F14>0,(N12/$F13)^(1/$F14)*1000,0)","v":8691.3889839531803},"trs/min",null,null,null,null,null,null,null,null,null,null,null,null,null,null,null,null,null,null,null,null,null,null,null,null,null,null,null,{"$f":"$C$16/(10/(AQ12*0.009806))^0.5","v":5979.8157228155624},{"$f":"$C$16/(10/(AR12*0.009806))^0.5","v":6552.6137112415045},7079.2158335982467,7569.2699244105506,8029.4705652679286,8464.6882948175953,"vitesse selon n10N"]
[null,"pas",{"$f":"IF($F10>0,INDEX('base mesures'!A:U,'test hélices'!F10*3-1,4),0)","v":4},null,"exp_f",{"$f":"IF($F10>0,INDEX('base mesures'!A:U,'test hélices'!F10*3-1,17),0)","v":1.85},null,"P  méc",{"$f":"IF($C13*$C14>0,$F15*(I13/1000)^$F16,\"\")","v":122.92138996364974},{"$f":"IF($C13*$C14>0,$F15*(J13/1000)^$F16,\"\")","v":156.31143466478551},191.50564892907028,228.32118795938428,266.61500209379312,{"$f":"IF($C13*$C14>0,$F15*(N13/1000)^$F16,\"\")","v":306.27158612483316},"watts",null,null,null,null,null,null,null,null,null,null,null,null,null,null,null,null,null,null,null,null,null,null,null,null,null,null,null,{"$f":"$C$15/(100/AQ17)^(1/3)","v":6105.9139073622837},6615.1308438509204,7078.4046355179707,7505.683736738285,7903.8080280766608,8277.714146926899,"vitesse selon n100W"]
[null,"n100W",{"$f":"IF($F10>0,INDEX('base mesures'!A:U,'test hélices'!F10*3-1,21),\"\")","v":5700},null,"kp",{"$f":"IF($F10>0,INDEX('base mesures'!A:U,'test hélices'!F10*3-1,19),0)","v":1.6},null,"P  élec",{"$f":"IF($C13*$C14>0,I14+$I$5*(($I$4*I14/I13)+$I$6)^2+($I$6*$I$13/$I$4)+(($I$4*I14/I13)+$I$6)*$I$5*$I$6,\"\")","v":141.91973179190154},176.97189151066988,213.95904864603565,252.69029034774681,293.01591432178554,334.81480298179849,"watts",null,null,null,null,null,null,null,null,null,null,null,null,null,null,null,null,null,null,null,null,null,null,null,null,null,null,null,{"$f":"(AQ12/$F$13)^(1/$F$14)*1000","v":5969.3769468864848},{"$f":"(AR12/$F$13)^(1/$F$14)*1000","v":6589.8701730167268},7164.2277794979236,7701.85179818089,8209.3055404624374,8691.3889839531803,"vitesse selon formule F = kf x (n / 1000)exp_f"]
[null,"n10N",{"$f":"IF($F10>0,INDEX('base mesures'!A:U,'test hélices'!F10*3-1,18),\"\")","v":5857},null,"exp_p",{"$f":"IF($F10>0,INDEX('base mesures'!A:U,'test hélices'!F10*3-1,20),0)","v":2.4300000000000002},null,"n100W",{"$f":"IF($C13*$C14>0,(I13*(100/I14)^(1/3)),\"\")","v":5572.5398545541793},{"$f":"IF($C13*$C14>0,(J13*(100/J14)^(1/3)),\"\")","v":5678.2338660937075},5769.1104769895555,5848.9748288686569,5920.316057071881,5984.8547955627573,"n100W",null,null,null,null,null,null,null,null,null,null,null,null,null,null,null,null,null,null,null,null,null,null,null,null,null,null,null,{"$f":"100*(AQ15/$C$15)^3","v":114.85831615190281},{"$f":"100*(AR15/$C$15)^3","v":154.52758199045599},198.55626236927998,246.69531708126132,298.7409052273722,354.52184005455723,"puissance mécanique selon n100W et vitesse selon formule"]
[null,null,null,null,null,null,null,"n10N",{"$f":"IF($C13*$C14>0,I13*(10/(9.80665*I12/1000))^0.5,\"\")","v":5846.5818497118416},{"$f":"IF($C13*$C14>0,J13*(10/(9.80665*J12/1000))^0.5,\"\")","v":5890.1061702605057},5927.138323160144,5959.392574926117,5987.9799871801915,6013.6624564845652,"n10N",null,null,null,null,null,null,null,null,null,null,null,null,null,null,null,null,null,null,null,null,null,null,null,null,null,null,null,{"$f":"I14","v":122.92138996364974},156.31143466478551,191.50564892907028,228.32118795938428,266.61500209379312,306.27158612483316,"puissance mécanique selon formule P = kp x (n / 1000)exp_p"]
[null,null,null,{"$f":"CONCATENATE(\"vitesse pour \",FIXED('moteur test'!$G$10,0),\" grs\")","v":"vitesse pour 1.063 grs"},{"$f":"I13","v":5969.3769468864848},"trs/min",null,"efficacité",{"$f":"IF($C13*$C14>0,I12/I14,\"\")","v":8.647803285614895},{"$f":"IF($C13*$C14>0,J12/J14,\"\")","v":8.1657493755161141},7.7794049853421878,7.4596668632565981,7.1886427430882343,6.9546118428754076,"grs/W",null,null,null,null,null,null,null,null,null,null,null,null,null,null,null,null,null,null,null,null,null,null,null,null,null,null,null,{"$f":"I18","v":8.647803285614895},8.1657493755161141,7.7794049853421878,7.4596668632565981,7.1886427430882343,6.9546118428754076,"efficacité selon formules"]
[null,null,null,{"$f":"CONCATENATE(\"P mécanique pour \",FIXED('moteur test'!$G$10,0),\" grs\")","v":"P mécanique pour 1.063 grs"},{"$f":"I14","v":122.92138996364974},"watts",null,null,null,null,null,null,null,null,null,null,null,null,null,null,null,null,null,null,null,null,null,null,null,null,null,null,null,null,null,null,null,null,null,null,null,null,{"$f":"AQ12/AQ16","v":9.2548805834325272},8.2600140606538055,7.5031629938180053,6.9040629556781044,6.415592797850274,6.0080924765374544,"efficacité selon n10N et n100W"]
[null,null,null,"efficacité",{"$f":"I18","v":8.647803285614895},"grs/wattméc"]
[]
[]
[null,null,null,null,"Hélice de base mesure n°",2]
[null,"Hélice n°2",null,null,null,"F = kf x (n / 1000)exp_f",null,null,null,null,{"$f":"CONCATENATE(\"traction vol stationnaire: \",FIXED('moteur test'!G$10,0),\" grs / \",\" traction maximale: \",FIXED('moteur test'!G$16,0),\" grs = \",FIXED('moteur test'!G$15,1))","v":"traction vol stationnaire: 1.063 grs /  traction maximale: 2.130 grs = 2,0"}]
[null,"marque",{"$f":"IF($F23>0,INDEX('base mesures'!A:U,'test hélices'!F23*3-1,2),\"\")","v":"RCTimer"},null,null,"P = kp x (n / 1000)exp_p",null,"traction",{"$f":"$L$3","v":1063},{"$f":"I25+($N$12-$I$12)/5","v":1276.4000000000001},{"$f":"J25+($N$12-$I$12)/5","v":1489.8000000000002},{"$f":"K25+($N$12-$I$12)/5","v":1703.2000000000003},{"$f":"L25+($N$12-$I$12)/5","v":1916.6000000000004},{"$f":"$Q$3","v":2130},"grs",null,null,null,null,null,null,null,null,null,null,null,null,null,null,null,null,null,null,null,null,null,null,null,null,null,null,null,{"$f":"I25","v":1063},{"$f":"J25","v":1276.4000000000001},1489.8000000000002,1703.2000000000003,1916.6000000000004,2130,"traction"]
[null,"diamètre",{"$f":"IF($F23>0,INDEX('base mesures'!A:U,'test hélices'!F23*3-1,3),0)","v":13},null," kf",{"$f":"IF($F23>0,INDEX('base mesures'!A:U,'test hélices'!F23*3-1,16),0)","v":45},null,"vitesse",{"$f":"IF($F26*$F27>0,(I25/$F26)^(1/$F27)*1000,0)","v":5191.2413963835788},{"$f":"IF($F26*$F27>0,(J25/$F26)^(1/$F27)*1000,0)","v":5710.2256660126632},{"$f":"IF($F26*$F27>0,(K25/$F26)^(1/$F27)*1000,0)","v":6189.0306494157094},{"$f":"IF($F26*$F27>0,(L25/$F26)^(1/$F27)*1000,0)","v":6635.9434177609883},{"$f":"IF($F26*$F27>0,(M25/$F26)^(1/$F27)*1000,0)","v":7056.7320988102128},{"$f":"IF($F26*$F27>0,(N25/$F26)^(1/$F27)*1000,0)","v":7455.6044555462122},"trs/min",null,null,null,null,null,null,null,null,null,null,null,null,null,null,null,null,null,null,null,null,null,null,null,null,null,null,null,{"$f":"$C$29/(10/(AQ25*0.009806))^0.5","v":5206.9421523577539},{"$f":"$C$29/(10/(AR25*0.009806))^0.5","v":5705.7076877807194},6164.248036768151,6590.9640796472268,6991.6851430538563,7370.6522628597804,"vitesse selon n10N"]
[null,"pas",{"$f":"IF($F23>0,INDEX('base mesures'!A:U,'test hélices'!F23*3-1,4),0)","v":6.5},null,"exp_f",{"$f":"IF($F23>0,INDEX('base mesures'!A:U,'test hélices'!F23*3-1,17),0)","v":"1,92"},null,"P  méc",{"$f":"IF($C26*$C27>0,$F28*(I26/1000)^$F29,\"\")","v":110.7011451151384},{"$f":"IF($C26*$C27>0,$F28*(J26/1000)^$F29,\"\")","v":144.55124816084535},181.10734282552178,220.15075195823462,261.50671776045402,305.03150036668183,"watts",null,null,null,null,null,null,null,null,null,null,null,null,null,null,null,null,null,null,null,null,null,null,null,null,null,null,null,{"$f":"$C$28/(100/AQ30)^(1/3)","v":5275.7905691315136},{"$f":"$C$28/(100/AR30)^(1/3)","v":5766.4800179198992},6216.5418594274606,6634.5310939369765,7026.3717887045586,7396.3662190315627,"vitesse selon n100W"]
[null,"n100W",{"$f":"IF($F23>0,INDEX('base mesures'!A:U,'test hélices'!F23*3-1,21),\"\")","v":5100},null,"kp",{"$f":"IF($F23>0,INDEX('base mesures'!A:U,'test hélices'!F23*3-1,19),0)","v":"1,1"},null,"P  élec",{"$f":"IF($C26*$C27>0,I27+$I$5*(($I$4*I27/I26)+$I$6)^2+($I$6*$I$13/$I$4)+(($I$4*I27/I26)+$I$6)*$I$5*$I$6,\"\")","v":130.07044381876716},166.1376277553785,205.21499383791274,247.07839779654415,291.54839053277828,338.47713175615121,"watts",null,null,null,null,null,null,null,null,null,null,null,null,null,null,null,null,null,null,null,null,null,null,null,null,null,null,null,{"$f":"(AQ25/$F$26)^(1/$F$27)*1000","v":5191.2413963835788},{"$f":"(AR25/$F$26)^(1/$F$27)*1000","v":5710.2256660126632},6189.0306494157094,6635.9434177609883,7056.7320988102128,7455.6044555462122,"vitesse selon formule F = kf x (n / 1000)exp_f"]
[null,"n10N",{"$f":"IF($F23>0,INDEX('base mesures'!A:U,'test hélices'!F23*3-1,18),\"\")","v":5100},null,"exp_p",{"$f":"IF($F23>0,INDEX('base mesures'!A:U,'test hélices'!F23*3-1,20),0)","v":"2,8"},null,"n100W",{"$f":"IF($C26*$C27>0,(I26*(100/I27)^(1/3)),\"\")","v":5018.2680253576764},{"$f":"IF($C26*$C27>0,(J26*(100/J27)^(1/3)),\"\")","v":5050.2474310436619},5077.4300287470678,5101.0856609759576,5122.0366337272026,5140.8464098826453,"n100W",null,null,null,null,null,null,null,null,null,null,null,null,null,null,null,null,null,null,null,null,null,null,null,null,null,null,null,{"$f":"100*(AQ28/$C$28)^3","v":105.46373425581261},{"$f":"100*(AR28/$C$28)^3","v":140.36191569161917},178.71350479562611,220.29137546577897,264.91122590170113,312.41943978534084,"puissance mécanique selon n100W et vitesse selon formule"]
[null,null,null,null,null,null,null,"n10N",{"$f":"IF($C26*$C27>0,I26*(10/(9.80665*I25/1000))^0.5,\"\")","v":5084.4532009993964},{"$f":"IF($C26*$C27>0,J26*(10/(9.80665*J25/1000))^0.5,\"\")","v":5103.8692031718911},5120.3342320217744,5134.6342370253269,5147.2771203722714,5158.610285133549,"n10N",null,null,null,null,null,null,null,null,null,null,null,null,null,null,null,null,null,null,null,null,null,null,null,null,null,null,null,{"$f":"I27","v":110.7011451151384},{"$f":"J27","v":144.55124816084535},{"$f":"K27","v":181.10734282552178},{"$f":"L27","v":220.15075195823462},{"$f":"M27","v":261.50671776045402},{"$f":"N27","v":305.03150036668183},"puissance mécanique selon formule P = kp x (n / 1000)exp_p"]
[null,null,null,{"$f":"CONCATENATE(\"vitesse pour \",FIXED('moteur test'!$G$10,0),\" grs\")","v":"vitesse pour 1.063 grs"},{"$f":"I26","v":5191.2413963835788},"trs/min",null,"efficacité",{"$f":"IF($C26*$C27>0,I25/I27,\"\")","v":9.6024300281120993},{"$f":"IF($C26*$C27>0,J25/J27,\"\")","v":8.8300863274436878},8.2260607259600107,7.7365168406198261,7.3290660232891174,6.9828853657392855,"grs/W",null,null,null,null,null,null,null,null,null,null,null,null,null,null,null,null,null,null,null,null,null,null,null,null,null,null,null,{"$f":"I31","v":9.6024300281120993},{"$f":"J31","v":8.8300863274436878},{"$f":"K31","v":8.2260607259600107},{"$f":"L31","v":7.7365168406198261},{"$f":"M31","v":7.3290660232891174},{"$f":"N31","v":6.9828853657392855},"efficacité selon formules"]
[null,null,null,{"$f":"CONCATENATE(\"P mécanique pour \",FIXED('moteur test'!$G$10,0),\" grs\")","v":"P mécanique pour 1.063 grs"},{"$f":"I27","v":110.7011451151384},"watts",null,null,null,null,null,null,null,null,null,null,null,null,null,null,null,null,null,null,null,null,null,null,null,null,null,null,null,null,null,null,null,null,null,null,null,null,{"$f":"AQ25/AQ29","v":10.079294152638189},{"$f":"AR25/AR29","v":9.093634791963817},8.3362474576485504,7.7315782172533707,7.2348764891948392,6.817757568042162,"efficacité selon n10N et n100W"]
[null,null,null,"efficacité",{"$f":"I31","v":9.6024300281120993},"grs/wattméc"]
[]
[]
[null,null,null,null,"Hélice de base mesure n°",3]
[null,"Hélice n°3",null,null,null,"F = kf x (n / 1000)exp_f",null,null,null,null,{"$f":"CONCATENATE(\"traction vol stationnaire: \",FIXED('moteur test'!G$10,0),\" grs / \",\" traction maximale: \",FIXED('moteur test'!G$16,0),\" grs = \",FIXED('moteur test'!G$15,1))","v":"traction vol stationnaire: 1.063 grs /  traction maximale: 2.130 grs = 2,0"}]
[null,"marque",{"$f":"IF($F36>0,INDEX('base mesures'!A:U,'test hélices'!F36*3-1,2),\"\")","v":"RCTimer"},null,null,"P = kp x (n / 1000)exp_p",null,"traction",{"$f":"$L$3","v":1063},{"$f":"I38+($N$12-$I$12)/5","v":1276.4000000000001},{"$f":"J38+($N$12-$I$12)/5","v":1489.8000000000002},{"$f":"K38+($N$12-$I$12)/5","v":1703.2000000000003},{"$f":"L38+($N$12-$I$12)/5","v":1916.6000000000004},{"$f":"$Q$3","v":2130},"grs",null,null,null,null,null,null,null,null,null,null,null,null,null,null,null,null,null,null,null,null,null,null,null,null,null,null,null,{"$f":"I38","v":1063},{"$f":"J38","v":1276.4000000000001},1489.8000000000002,1703.2000000000003,1916.6000000000004,2130,"traction"]
[null,"diamètre",{"$f":"IF($F36>0,INDEX('base mesures'!A:U,'test hélices'!F36*3-1,3),0)","v":14},null," kf",{"$f":"IF($F36>0,INDEX('base mesures'!A:U,'test hélices'!F36*3-1,16),0)","v":39},null,"vitesse",{"$f":"IF($F39*$F40>0,(I38/$F39)^(1/$F40)*1000,0)","v":5643.5746099932385},{"$f":"IF($F39*$F40>0,(J38/$F39)^(1/$F40)*1000,0)","v":6210.8777106528596},{"$f":"IF($F39*$F40>0,(K38/$F39)^(1/$F40)*1000,0)","v":6734.5010599757252},{"$f":"IF($F39*$F40>0,(L38/$F39)^(1/$F40)*1000,0)","v":7223.4388519088625},{"$f":"IF($F39*$F40>0,(M38/$F39)^(1/$F40)*1000,0)","v":7683.9539283584691},{"$f":"IF($F39*$F40>0,(N38/$F39)^(1/$F40)*1000,0)","v":8120.6165401542612},"trs/min",null,null,null,null,null,null,null,null,null,null,null,null,null,null,null,null,null,null,null,null,null,null,null,null,null,null,null,{"$f":"$C$42/(10/(AQ38*0.009806))^0.5","v":5615.3297721505196},{"$f":"$C$42/(10/(AR38*0.009806))^0.5","v":6153.2141730968542},6647.7184710244765,7107.9024388352445,7540.0526052541582,7948.7426364174107,"vitesse selon n10N"]
[null,"pas",{"$f":"IF($F36>0,INDEX('base mesures'!A:U,'test hélices'!F36*3-1,4),0)","v":4.7},null,"exp_f",{"$f":"IF($F36>0,INDEX('base mesures'!A:U,'test hélices'!F36*3-1,17),0)","v":1.91},null,"P  méc",{"$f":"IF($C39*$C40>0,$F41*(I39/1000)^$F42,\"\")","v":130.64438844038364},{"$f":"IF($C39*$C40>0,$F41*(J39/1000)^$F42,\"\")","v":163.78107205809511},198.25469697779982,233.91524256193321,270.64667508410878,308.35623102933289,"watts",null,null,null,null,null,null,null,null,null,null,null,null,null,null,null,null,null,null,null,null,null,null,null,null,null,null,null,{"$f":"$C$41/(100/AQ43)^(1/3)","v":5848.5835997704244},{"$f":"$C$41/(100/AR43)^(1/3)","v":6306.3056863617639},6720.9130536786824,7101.8793419333742,7455.6929504098916,7787.0212217736707,"vitesse selon n100W"]
[null,"n100W",{"$f":"IF($F36>0,INDEX('base mesures'!A:U,'test hélices'!F36*3-1,21),\"\")","v":5350},null,"kp",{"$f":"IF($F36>0,INDEX('base mesures'!A:U,'test hélices'!F36*3-1,19),0)","v":2.2000000000000002},null,"P  élec",{"$f":"IF($C39*$C40>0,I40+$I$5*(($I$4*I40/I39)+$I$6)^2+($I$6*$I$13/$I$4)+(($I$4*I40/I39)+$I$6)*$I$5*$I$6,\"\")","v":150.98633051611435},186.00964467582236,222.48233971711497,260.24576315891164,299.17686731273739,339.17704779989646,"watts",null,null,null,null,null,null,null,null,null,null,null,null,null,null,null,null,null,null,null,null,null,null,null,null,null,null,null,{"$f":"(AQ38/$F$39)^(1/$F$40)*1000","v":5643.5746099932385},{"$f":"(AR38/$F$39)^(1/$F$40)*1000","v":6210.8777106528596},6734.5010599757252,7223.4388519088625,7683.9539283584691,8120.6165401542612,"vitesse selon formule F = kf x (n / 1000)exp_f"]
[null,"n10N",{"$f":"IF($F36>0,INDEX('base mesures'!A:U,'test hélices'!F36*3-1,18),\"\")","v":5500},null,"exp_p",{"$f":"IF($F36>0,INDEX('base mesures'!A:U,'test hélices'!F36*3-1,20),0)","v":2.36},null,"n100W",{"$f":"IF($C39*$C40>0,(I39*(100/I40)^(1/3)),\"\")","v":5162.4677408473744},{"$f":"IF($C39*$C40>0,(J39*(100/J40)^(1/3)),\"\")","v":5269.042987220434},5360.8163627632985,5441.5734198029641,5513.7937935678738,5579.1935391604911,"n100W",null,null,null,null,null,null,null,null,null,null,null,null,null,null,null,null,null,null,null,null,null,null,null,null,null,null,null,{"$f":"100*(AQ41/$C$41)^3","v":117.38198968610496},{"$f":"100*(AR41/$C$41)^3","v":156.45793312851532},199.45959402858108,246.13345962805866,296.27357002869303,349.70807775755901,"puissance mécanique selon n100W et vitesse selon formule"]
[null,null,null,null,null,null,null,"n10N",{"$f":"IF($C39*$C40>0,I39*(10/(9.80665*I38/1000))^0.5,\"\")","v":5527.4815405133613},{"$f":"IF($C39*$C40>0,J39*(10/(9.80665*J38/1000))^0.5,\"\")","v":5551.3580944346468},5571.6150502883793,5589.2152936084676,5604.781320252001,5618.7390647451357,"n10N",null,null,null,null,null,null,null,null,null,null,null,null,null,null,null,null,null,null,null,null,null,null,null,null,null,null,null,{"$f":"I40","v":130.64438844038364},{"$f":"J40","v":163.78107205809511},{"$f":"K40","v":198.25469697779982},{"$f":"L40","v":233.91524256193321},{"$f":"M40","v":270.64667508410878},{"$f":"N40","v":308.35623102933289},"puissance mécanique selon formule P = kp x (n / 1000)exp_p"]
[null,null,null,{"$f":"CONCATENATE(\"vitesse pour \",FIXED('moteur test'!$G$10,0),\" grs\")","v":"vitesse pour 1.063 grs"},{"$f":"I39","v":5643.5746099932385},"trs/min",null,"efficacité",{"$f":"IF($C39*$C40>0,I38/I40,\"\")","v":8.1365913430340253},{"$f":"IF($C39*$C40>0,J38/J40,\"\")","v":7.7933303522842108},7.5145760615539166,7.281269836654821,7.0815575303276095,6.9075951307673762,"grs/W",null,null,null,null,null,null,null,null,null,null,null,null,null,null,null,null,null,null,null,null,null,null,null,null,null,null,null,{"$f":"I44","v":8.1365913430340253},{"$f":"J44","v":7.7933303522842108},{"$f":"K44","v":7.5145760615539166},{"$f":"L44","v":7.281269836654821},{"$f":"M44","v":7.0815575303276095},{"$f":"N44","v":6.9075951307673762},"efficacité selon formules"]
[null,null,null,{"$f":"CONCATENATE(\"P mécanique pour \",FIXED('moteur test'!$G$10,0),\" grs\")","v":"P mécanique pour 1.063 grs"},{"$f":"I40","v":130.64438844038364},"watts",null,null,null,null,null,null,null,null,null,null,null,null,null,null,null,null,null,null,null,null,null,null,null,null,null,null,null,null,null,null,null,null,null,null,null,null,{"$f":"AQ38/AQ42","v":9.0559037450515465},{"$f":"AR38/AR42","v":8.1581034242064216},7.4691819526441172,6.9198231015554263,6.4690211813844369,6.0907943953089303,"efficacité selon n10N et n100W"]
[null,null,null,"efficacité",{"$f":"I44","v":8.1365913430340253},"grs/wattméc"]
[]
[]
[null,null,null,null,"Hélice de base mesure n°",4]
[null,"Hélice n°4",null,null,null,"F = kf x (n / 1000)exp_f",null,null,null,null,{"$f":"CONCATENATE(\"traction vol stationnaire: \",FIXED('moteur test'!G$10,0),\" grs / \",\" traction maximale: \",FIXED('moteur test'!G$16,0),\" grs = \",FIXED('moteur test'!G$15,1))","v":"traction vol stationnaire: 1.063 grs /  traction maximale: 2.130 grs = 2,0"}]
[null,"marque",{"$f":"IF($F49>0,INDEX('base mesures'!A:U,'test hélices'!F49*3-1,2),\"\")","v":"RCTimer"},null,null,"P = kp x (n / 1000)exp_p",null,"traction",{"$f":"$L$3","v":1063},{"$f":"I51+($N$12-$I$12)/5","v":1276.4000000000001},{"$f":"J51+($N$12-$I$12)/5","v":1489.8000000000002},{"$f":"K51+($N$12-$I$12)/5","v":1703.2000000000003},{"$f":"L51+($N$12-$I$12)/5","v":1916.6000000000004},{"$f":"$Q$3","v":2130},"grs",null,null,null,null,null,null,null,null,null,null,null,null,null,null,null,null,null,null,null,null,null,null,null,null,null,null,null,{"$f":"I51","v":1063},{"$f":"J51","v":1276.4000000000001},1489.8000000000002,1703.2000000000003,1916.6000000000004,2130,"traction"]
[null,"diamètre",{"$f":"IF($F49>0,INDEX('base mesures'!A:U,'test hélices'!F49*3-1,3),0)","v":18},null," kf",{"$f":"IF($F49>0,INDEX('base mesures'!A:U,'test hélices'!F49*3-1,16),0)","v":85},null,"vitesse",{"$f":"IF($F52*$F53>0,(I51/$F52)^(1/$F53)*1000,0)","v":3311.0016888917107},{"$f":"IF($F52*$F53>0,(J51/$F52)^(1/$F53)*1000,0)","v":3610.8970309291253},{"$f":"IF($F52*$F53>0,(K51/$F52)^(1/$F53)*1000,0)","v":3885.3984803822286},{"$f":"IF($F52*$F53>0,(L51/$F52)^(1/$F53)*1000,0)","v":4139.8915859100598},{"$f":"IF($F52*$F53>0,(M51/$F52)^(1/$F53)*1000,0)","v":4378.0989466505962},{"$f":"IF($F52*$F53>0,(N51/$F52)^(1/$F53)*1000,0)","v":4602.7198219781794},"trs/min",null,null,null,null,null,null,null,null,null,null,null,null,null,null,null,null,null,null,null,null,null,null,null,null,null,null,null,{"$f":"$C$55/(10/(AQ51*0.009806))^0.5","v":3267.1009583421201},{"$f":"$C$55/(10/(AR51*0.009806))^0.5","v":3580.0518825290787},3867.7634740506046,4135.5068735041423,4386.9396976024191,4624.7229884610388,"vitesse selon n10N"]
[null,"pas",{"$f":"IF($F49>0,INDEX('base mesures'!A:U,'test hélices'!F49*3-1,4),0)","v":4},null,"exp_f",{"$f":"IF($F49>0,INDEX('base mesures'!A:U,'test hélices'!F49*3-1,17),0)","v":"2,11"},null,"P  méc",{"$f":"IF($C52*$C53>0,$F54*(I52/1000)^$F55,\"\")","v":88.89013887220321},{"$f":"IF($C52*$C53>0,$F54*(J52/1000)^$F55,\"\")","v":114.79894721021859},142.49783551002196,171.82676113662049,202.65894945289276,234.89092525618824,"watts",null,null,null,null,null,null,null,null,null,null,null,null,null,null,null,null,null,null,null,null,null,null,null,null,null,null,null,{"$f":"$C$54/(100/AQ56)^(1/3)","v":3317.1895606797748},{"$f":"$C$54/(100/AR56)^(1/3)","v":3612.4213206390714},3882.2948660381148,4132.2129686572007,4365.9057637799597,4586.075229946171,"vitesse selon n100W"]
[null,"n100W",{"$f":"IF($F49>0,INDEX('base mesures'!A:U,'test hélices'!F49*3-1,21),\"\")","v":3450},null,"kp",{"$f":"IF($F49>0,INDEX('base mesures'!A:U,'test hélices'!F49*3-1,19),0)","v":"2,6"},null,"P  élec",{"$f":"IF($C52*$C53>0,I53+$I$5*(($I$4*I53/I52)+$I$6)^2+($I$6*$I$13/$I$4)+(($I$4*I53/I52)+$I$6)*$I$5*$I$6,\"\")","v":111.41645899010133},140.69322159873789,172.21867756545078,205.82267032978902,241.36979687377206,278.74907666229473,"watts",null,null,null,null,null,null,null,null,null,null,null,null,null,null,null,null,null,null,null,null,null,null,null,null,null,null,null,{"$f":"(AQ51/$F$52)^(1/$F$53)*1000","v":3311.0016888917107},{"$f":"(AR51/$F$52)^(1/$F$53)*1000","v":3610.8970309291253},3885.3984803822286,4139.8915859100598,4378.0989466505962,4602.7198219781794,"vitesse selon formule F = kf x (n / 1000)exp_f"]
[null,"n10N",{"$f":"IF($F49>0,INDEX('base mesures'!A:U,'test hélices'!F49*3-1,18),\"\")","v":3200},null,"exp_p",{"$f":"IF($F49>0,INDEX('base mesures'!A:U,'test hélices'!F49*3-1,20),0)","v":"2,95"},null,"n100W",{"$f":"IF($C52*$C53>0,(I52*(100/I53)^(1/3)),\"\")","v":3443.5643841636697},{"$f":"IF($C52*$C53>0,(J52*(100/J53)^(1/3)),\"\")","v":3448.5442452492271},3452.7580258214953,3456.410906147215,3459.6352242076969,3462.5213476951844,"n100W",null,null,null,null,null,null,null,null,null,null,null,null,null,null,null,null,null,null,null,null,null,null,null,null,null,null,null,{"$f":"100*(AQ54/$C$54)^3","v":88.393620328390881},{"$f":"100*(AR54/$C$54)^3","v":114.65368755328487},142.83985896988503,172.7864250259708,204.36166504421155,237.45774125847515,"puissance mécanique selon n100W et vitesse selon formule"]
[null,null,null,null,null,null,null,"n10N",{"$f":"IF($C52*$C53>0,I52*(10/(9.80665*I51/1000))^0.5,\"\")","v":3242.891603408681},{"$f":"IF($C52*$C53>0,J52*(10/(9.80665*J51/1000))^0.5,\"\")","v":3227.4637168329227},3214.4838135556333,3203.2866672270488,3193.445382830967,3184.6697279630816,"n10N",null,null,null,null,null,null,null,null,null,null,null,null,null,null,null,null,null,null,null,null,null,null,null,null,null,null,null,{"$f":"I53","v":88.89013887220321},{"$f":"J53","v":114.79894721021859},{"$f":"K53","v":142.49783551002196},{"$f":"L53","v":171.82676113662049},{"$f":"M53","v":202.65894945289276},{"$f":"N53","v":234.89092525618824},"puissance mécanique selon formule P = kp x (n / 1000)exp_p"]
[null,null,null,{"$f":"CONCATENATE(\"vitesse pour \",FIXED('moteur test'!$G$10,0),\" grs\")","v":"vitesse pour 1.063 grs"},{"$f":"I52","v":3311.0016888917107},"trs/min",null,"efficacité",{"$f":"IF($C52*$C53>0,I51/I53,\"\")","v":11.958581834687742},{"$f":"IF($C52*$C53>0,J51/J53,\"\")","v":11.118568863377034},10.454895645732259,9.9123092860126469,9.4572680119685817,9.0680386978631677,"grs/W",null,null,null,null,null,null,null,null,null,null,null,null,null,null,null,null,null,null,null,null,null,null,null,null,null,null,null,{"$f":"I57","v":11.958581834687742},{"$f":"J57","v":11.118568863377034},{"$f":"K57","v":10.454895645732259},{"$f":"L57","v":9.9123092860126469},{"$f":"M57","v":9.4572680119685817},{"$f":"N57","v":9.0680386978631677},"efficacité selon formules"]
[null,null,null,{"$f":"CONCATENATE(\"P mécanique pour \",FIXED('moteur test'!$G$10,0),\" grs\")","v":"P mécanique pour 1.063 grs"},{"$f":"I53","v":88.89013887220321},"watts",null,null,null,null,null,null,null,null,null,null,null,null,null,null,null,null,null,null,null,null,null,null,null,null,null,null,null,null,null,null,null,null,null,null,null,null,{"$f":"AQ51/AQ55","v":12.025754755273647},11.132655453465446,10.429861879897929,9.8572558564366357,9.3784712489270614,8.9700171016175609,"efficacité selon n10N et n100W"]
[null,null,null,"efficacité",{"$f":"I57","v":11.958581834687742},"grs/wattméc"]
[]
[]
[null,null,null,null,"Hélice de base mesure n°",5]
[null,"Hélice n°5",null,null,null,"F = kf x (n / 1000)exp_f",null,null,null,null,{"$f":"CONCATENATE(\"traction vol stationnaire: \",FIXED('moteur test'!G$10,0),\" grs / \",\" traction maximale: \",FIXED('moteur test'!G$16,0),\" grs = \",FIXED('moteur test'!G$15,1))","v":"traction vol stationnaire: 1.063 grs /  traction maximale: 2.130 grs = 2,0"}]
[null,"marque",{"$f":"IF($F62>0,INDEX('base mesures'!A:U,'test hélices'!F62*3-1,2),\"\")","v":"HK"},null,null,"P = kp x (n / 1000)exp_p",null,"traction",{"$f":"$L$3","v":1063},{"$f":"I64+($N$12-$I$12)/5","v":1276.4000000000001},{"$f":"J64+($N$12-$I$12)/5","v":1489.8000000000002},{"$f":"K64+($N$12-$I$12)/5","v":1703.2000000000003},{"$f":"L64+($N$12-$I$12)/5","v":1916.6000000000004},{"$f":"$Q$3","v":2130},"grs",null,null,null,null,null,null,null,null,null,null,null,null,null,null,null,null,null,null,null,null,null,null,null,null,null,null,null,{"$f":"I64","v":1063},{"$f":"J64","v":1276.4000000000001},1489.8000000000002,1703.2000000000003,1916.6000000000004,2130,"traction"]
[null,"diamètre",{"$f":"IF($F62>0,INDEX('base mesures'!A:U,'test hélices'!F62*3-1,3),0)","v":18},null," kf",{"$f":"IF($F62>0,INDEX('base mesures'!A:U,'test hélices'!F62*3-1,16),0)","v":90},null,"vitesse",{"$f":"IF($F65*$F66>0,(I64/$F65)^(1/$F66)*1000,0)","v":3222.5129453244672},{"$f":"IF($F65*$F66>0,(J64/$F65)^(1/$F66)*1000,0)","v":3514.3933829576977},{"$f":"IF($F65*$F66>0,(K64/$F65)^(1/$F66)*1000,0)","v":3781.5585968386517},{"$f":"IF($F65*$F66>0,(L64/$F65)^(1/$F66)*1000,0)","v":4029.250203221909},{"$f":"IF($F65*$F66>0,(M64/$F65)^(1/$F66)*1000,0)","v":4261.091312283651},{"$f":"IF($F65*$F66>0,(N64/$F65)^(1/$F66)*1000,0)","v":4479.7090438788109},"trs/min",null,null,null,null,null,null,null,null,null,null,null,null,null,null,null,null,null,null,null,null,null,null,null,null,null,null,null,{"$f":"$C$68/(10/(AQ64*0.009806))^0.5","v":3216.0525058680246},{"$f":"$C$68/(10/(AR64*0.009806))^0.5","v":3524.1135718645619},3807.3296697685637,4070.8895786056401,4318.3937648273813,4552.4616917663352,"vitesse selon n10N"]
[null,"pas",{"$f":"IF($F62>0,INDEX('base mesures'!A:U,'test hélices'!F62*3-1,4),0)","v":5.5},null,"exp_f",{"$f":"IF($F62>0,INDEX('base mesures'!A:U,'test hélices'!F62*3-1,17),0)","v":2.11},null,"P  méc",{"$f":"IF($C65*$C66>0,$F67*(I65/1000)^$F68,\"\")","v":114.7457428098064},{"$f":"IF($C65*$C66>0,$F67*(J65/1000)^$F68,\"\")","v":152.35991682864244},193.60815084661635,238.24470762650051,286.070554991574,336.92006784089858,"watts",null,null,null,null,null,null,null,null,null,null,null,null,null,null,null,null,null,null,null,null,null,null,null,null,null,null,null,{"$f":"$C$67/(100/AQ69)^(1/3)","v":3161.6889170493823},{"$f":"$C$67/(100/AR69)^(1/3)","v":3475.0723581822799},3763.9873510233892,4033.4935205171946,4287.1103509364657,4527.4038529923255,"vitesse selon n100W"]
[null,"n100W",{"$f":"IF($F62>0,INDEX('base mesures'!A:U,'test hélices'!F62*3-1,21),\"\")","v":3020},null,"kp",{"$f":"IF($F62>0,INDEX('base mesures'!A:U,'test hélices'!F62*3-1,19),0)","v":2.5},null,"P  élec",{"$f":"IF($C65*$C66>0,I66+$I$5*(($I$4*I66/I65)+$I$6)^2+($I$6*$I$13/$I$4)+(($I$4*I66/I65)+$I$6)*$I$5*$I$6,\"\")","v":143.58732371379369},188.12041344615926,237.65369014872707,291.9728634363301,350.90682841268494,414.31512712662152,"watts",null,null,null,null,null,null,null,null,null,null,null,null,null,null,null,null,null,null,null,null,null,null,null,null,null,null,null,{"$f":"(AQ64/$F$65)^(1/$F$66)*1000","v":3222.5129453244672},{"$f":"(AR64/$F$65)^(1/$F$66)*1000","v":3514.3933829576977},3781.5585968386517,4029.250203221909,4261.091312283651,4479.7090438788109,"vitesse selon formule F = kf x (n / 1000)exp_f"]
[null,"n10N",{"$f":"IF($F62>0,INDEX('base mesures'!A:U,'test hélices'!F62*3-1,18),\"\")","v":3150},null,"exp_p",{"$f":"IF($F62>0,INDEX('base mesures'!A:U,'test hélices'!F62*3-1,20),0)","v":3.27},null,"n100W",{"$f":"IF($C65*$C66>0,(I65*(100/I66)^(1/3)),\"\")","v":3078.09824122804},{"$f":"IF($C65*$C66>0,(J65*(100/J66)^(1/3)),\"\")","v":3054.1718049531137},3034.0981245188468,3016.8228985204569,3001.6712213357569,2988.1852275167334,"n100W",null,null,null,null,null,null,null,null,null,null,null,null,null,null,null,null,null,null,null,null,null,null,null,null,null,null,null,{"$f":"100*(AQ67/$C$67)^3","v":121.49633658979464},{"$f":"100*(AR67/$C$67)^3","v":157.59059265231735},196.33226379200468,237.4935835313901,280.8935028344755,326.38379953904615,"puissance mécanique selon n100W et vitesse selon formule"]
[null,null,null,null,null,null,null,"n10N",{"$f":"IF($C65*$C66>0,I65*(10/(9.80665*I64/1000))^0.5,\"\")","v":3156.2231476138272},{"$f":"IF($C65*$C66>0,J65*(10/(9.80665*J64/1000))^0.5,\"\")","v":3141.2075816670699},3128.5745750212391,3117.6766799474885,3108.0984104855938,3099.5572908871541,"n10N",null,null,null,null,null,null,null,null,null,null,null,null,null,null,null,null,null,null,null,null,null,null,null,null,null,null,null,{"$f":"I66","v":114.7457428098064},{"$f":"J66","v":152.35991682864244},{"$f":"K66","v":193.60815084661635},{"$f":"L66","v":238.24470762650051},{"$f":"M66","v":286.070554991574},{"$f":"N66","v":336.92006784089858},"puissance mécanique selon formule P = kp x (n / 1000)exp_p"]
[null,null,null,{"$f":"CONCATENATE(\"vitesse pour \",FIXED('moteur test'!$G$10,0),\" grs\")","v":"vitesse pour 1.063 grs"},{"$f":"I65","v":3222.5129453244672},"trs/min",null,"efficacité",{"$f":"IF($C65*$C66>0,I64/I66,\"\")","v":9.2639602478494201},{"$f":"IF($C65*$C66>0,J64/J66,\"\")","v":8.3775314831364298},7.6949239661933229,7.148952087826145,6.6997458024173531,6.3219742701875363,"grs/W",null,null,null,null,null,null,null,null,null,null,null,null,null,null,null,null,null,null,null,null,null,null,null,null,null,null,null,{"$f":"I70","v":9.2639602478494201},{"$f":"J70","v":8.3775314831364298},{"$f":"K70","v":7.6949239661933229},{"$f":"L70","v":7.148952087826145},{"$f":"M70","v":6.6997458024173531},{"$f":"N70","v":6.3219742701875363},"efficacité selon formules"]
[null,null,null,{"$f":"CONCATENATE(\"P mécanique pour \",FIXED('moteur test'!$G$10,0),\" grs\")","v":"P mécanique pour 1.063 grs"},{"$f":"I66","v":114.7457428098064},"watts",null,null,null,null,null,null,null,null,null,null,null,null,null,null,null,null,null,null,null,null,null,null,null,null,null,null,null,null,null,null,null,null,null,null,null,null,{"$f":"AQ64/AQ68","v":8.7492349961874414},8.0994682393005828,7.5881567869980922,7.1715621730676533,6.823226527704386,6.5260592070078607,"efficacité selon n10N et n100W"]
[null,null,null,"efficacité",{"$f":"I70","v":9.2639602478494201},"grs/wattméc"]
[]
[]
[null,null,null,null,"Hélice de base mesure n°"]
[null,"Hélice n°6",null,null,null,"F = kf x (n / 1000)exp_f",null,null,null,null,{"$f":"CONCATENATE(\"traction vol stationnaire: \",FIXED('moteur test'!G$10,0),\" grs / \",\" traction maximale: \",FIXED('moteur test'!G$16,0),\" grs = \",FIXED('moteur test'!G$15,1))","v":"traction vol stationnaire: 1.063 grs /  traction maximale: 2.130 grs = 2,0"}]
[null,"marque",{"$f":"IF($F75>0,INDEX('base mesures'!A:U,'test hélices'!F75*3-1,2),\"\")","v":""},null,null,"P = kp x (n / 1000)exp_p",null,"traction",{"$f":"$L$3","v":1063},{"$f":"I77+($N$12-$I$12)/5","v":1276.4000000000001},{"$f":"J77+($N$12-$I$12)/5","v":1489.8000000000002},{"$f":"K77+($N$12-$I$12)/5","v":1703.2000000000003},{"$f":"L77+($N$12-$I$12)/5","v":1916.6000000000004},{"$f":"$Q$3","v":2130},"grs",null,null,null,null,null,null,null,null,null,null,null,null,null,null,null,null,null,null,null,null,null,null,null,null,null,null,null,{"$f":"I77","v":1063},{"$f":"J77","v":1276.4000000000001},1489.8000000000002,1703.2000000000003,1916.6000000000004,2130,"traction"]
[null,"diamètre",{"$f":"IF($F75>0,INDEX('base mesures'!A:U,'test hélices'!F75*3-1,3),0)","v":0},null," kf",{"$f":"IF($F75>0,INDEX('base mesures'!A:U,'test hélices'!F75*3-1,16),0)","v":0},null,"vitesse",{"$f":"IF($F78*$F79>0,(I77/$F78)^(1/$F79)*1000,0)","v":0},{"$f":"IF($F78*$F79>0,(J77/$F78)^(1/$F79)*1000,0)","v":0},0,0,0,0,"trs/min",null,null,null,null,null,null,null,null,null,null,null,null,null,null,null,null,null,null,null,null,null,null,null,null,null,null,null,{"$f":"$C$81/(10/(AQ77*0.009806))^0.5","v":{"$error":"#VALUE!"}},{"$f":"$C$81/(10/(AR77*0.009806))^0.5","v":{"$error":"#VALUE!"}},{"$error":"#VALUE!"},{"$error":"#VALUE!"},{"$error":"#VALUE!"},{"$error":"#VALUE!"},"vitesse selon n10N"]
[null,"pas",{"$f":"IF($F75>0,INDEX('base mesures'!A:U,'test hélices'!F75*3-1,4),0)","v":0},null,"exp_f",{"$f":"IF($F75>0,INDEX('base mesures'!A:U,'test hélices'!F75*3-1,17),0)","v":0},null,"P  méc",{"$f":"IF($C78*$C79>0,$F80*(I78/1000)^$F81,\"\")","v":""},{"$f":"IF($C78*$C79>0,$F80*(J78/1000)^$F81,\"\")","v":""},"","","","","watts",null,null,null,null,null,null,null,null,null,null,null,null,null,null,null,null,null,null,null,null,null,null,null,null,null,null,null,{"$f":"$C$80/(100/AQ82)^(1/3)","v":{"$error":"#VALUE!"}},{"$f":"$C$80/(100/AR82)^(1/3)","v":{"$error":"#VALUE!"}},{"$error":"#VALUE!"},{"$error":"#VALUE!"},{"$error":"#VALUE!"},{"$error":"#VALUE!"},"vitesse selon n100W"]
[null,"n100W",{"$f":"IF($F75>0,INDEX('base mesures'!A:U,'test hélices'!F75*3-1,21),\"\")","v":""},null,"kp",{"$f":"IF($F75>0,INDEX('base mesures'!A:U,'test hélices'!F75*3-1,19),0)","v":0},null,"P  élec",{"$f":"IF($C78*$C79>0,I79+$I$5*(($I$4*I79/I78)+$I$6)^2+($I$6*$I$13/$I$4)+(($I$4*I79/I78)+$I$6)*$I$5*$I$6,\"\")","v":""},"","","","","","watts",null,null,null,null,null,null,null,null,null,null,null,null,null,null,null,null,null,null,null,null,null,null,null,null,null,null,null,{"$f":"(AQ77/$F$78)^(1/$F$79)*1000","v":{"$error":"#DIV/0!"}},{"$f":"(AR77/$F$78)^(1/$F$79)*1000","v":{"$error":"#DIV/0!"}},{"$error":"#DIV/0!"},{"$error":"#DIV/0!"},{"$error":"#DIV/0!"},{"$error":"#DIV/0!"},"vitesse selon formule F = kf x (n / 1000)exp_f"]
[null,"n10N",{"$f":"IF($F75>0,INDEX('base mesures'!A:U,'test hélices'!F75*3-1,18),\"\")","v":""},null,"exp_p",{"$f":"IF($F75>0,INDEX('base mesures'!A:U,'test hélices'!F75*3-1,20),0)","v":0},null,"n100W",{"$f":"IF($C78*$C79>0,(I78*(100/I79)^(1/3)),\"\")","v":""},{"$f":"IF($C78*$C79>0,(J78*(100/J79)^(1/3)),\"\")","v":""},"","","","","n100W",null,null,null,null,null,null,null,null,null,null,null,null,null,null,null,null,null,null,null,null,null,null,null,null,null,null,null,{"$f":"100*(AQ80/$C$80)^3","v":{"$error":"#DIV/0!"}},{"$f":"100*(AR80/$C$80)^3","v":{"$error":"#DIV/0!"}},{"$error":"#DIV/0!"},{"$error":"#DIV/0!"},{"$error":"#DIV/0!"},{"$error":"#DIV/0!"},"puissance mécanique selon n100W et vitesse selon formule"]
[null,null,null,null,null,null,null,"n10N",{"$f":"IF($C78*$C79>0,I78*(10/(9.80665*I77/1000))^0.5,\"\")","v":""},{"$f":"IF($C78*$C79>0,J78*(10/(9.80665*J77/1000))^0.5,\"\")","v":""},"","","","","n10N",null,null,null,null,null,null,null,null,null,null,null,null,null,null,null,null,null,null,null,null,null,null,null,null,null,null,null,{"$f":"I79","v":""},{"$f":"J79","v":""},{"$f":"K79","v":""},{"$f":"L79","v":""},{"$f":"M79","v":""},{"$f":"N79","v":""},"puissance mécanique selon formule P = kp x (n / 1000)exp_p"]
[null,null,null,{"$f":"CONCATENATE(\"vitesse pour \",FIXED('moteur test'!$G$10,0),\" grs\")","v":"vitesse pour 1.063 grs"},{"$f":"I78","v":0},"trs/min",null,"efficacité",{"$f":"IF($C78*$C79>0,I77/I79,\"\")","v":""},{"$f":"IF($C78*$C79>0,J77/J79,\"\")","v":""},"","","","","grs/W",null,null,null,null,null,null,null,null,null,null,null,null,null,null,null,null,null,null,null,null,null,null,null,null,null,null,null,{"$f":"I83","v":""},{"$f":"J83","v":""},{"$f":"K83","v":""},{"$f":"L83","v":""},{"$f":"M83","v":""},{"$f":"N83","v":""},"efficacité selon formules"]
[null,null,null,{"$f":"CONCATENATE(\"P mécanique pour \",FIXED('moteur test'!$G$10,0),\" grs\")","v":"P mécanique pour 1.063 grs"},{"$f":"I79","v":""},"watts",null,null,null,null,null,null,null,null,null,null,null,null,null,null,null,null,null,null,null,null,null,null,null,null,null,null,null,null,null,null,null,null,null,null,null,null,{"$f":"AQ77/AQ81","v":{"$error":"#DIV/0!"}},{"$error":"#DIV/0!"},{"$error":"#DIV/0!"},{"$error":"#DIV/0!"},{"$error":"#DIV/0!"},{"$error":"#DIV/0!"},"efficacité selon n10N et n100W"]
[null,null,null,"efficacité",{"$f":"I83","v":""},"grs/wattméc"]
[]
[]
[null,null,null,null,null,"Efficacité en fonction de la traction"]

{"sheet":"moteurs","index":7,"n_rows":100,"n_cols":25,"rows_kept":100,"cut":false,"hidden":false,"merged":[]}
[null,"au départ",null,"rapport traction max/poids",{"$f":"IF(E3=0,'moteur test'!G15,E3)","v":2.35},null,"traction en stationnaire",{"$f":"E2/4","v":1062.5},"grs / moteur",{"$f":"H1/1000*9.806","v":10.418875},"Newtons",null,null,null,null,null,"Helice 1","Helice 2","Helice 3","Helice 4","Helice 5","Helice 6"]
[null,null,null,"poids du quadricoptère",{"$f":"IF(E4=0,taille!E4,E4)","v":4250},"grs",null,{"$f":"FIXED($H$1*(1+$E$1)/2,0)","v":"1.780"},"grs / moteur",{"$f":"CONCATENATE(\"traction/poids de \",FIXED((1+$E$1)/2,1))","v":"traction/poids de 1,7"},null,null,null,null,null,"marque",{"$f":"'test hélices'!C12","v":"RCTimer"},{"$f":"'test hélices'!C25","v":"RCTimer"},{"$f":"'test hélices'!C38","v":"RCTimer"},{"$f":"'test hélices'!C51","v":"RCTimer"},{"$f":"'test hélices'!C64","v":"HK"},{"$f":"'test hélices'!C77","v":""}]
[null,"modifier ?",null,"rapport traction max/poids",2.35,null,null,{"$f":"FIXED($H$1*$E$1,0)","v":"2.497"},"grs / moteur",{"$f":"CONCATENATE(\"traction/poids de \",FIXED(E1,1))","v":"traction/poids de 2,4"},null,null,null,null,null,"diamètre",{"$f":"'test hélices'!C13","v":13},{"$f":"'test hélices'!C26","v":13},{"$f":"'test hélices'!C39","v":14},{"$f":"'test hélices'!C52","v":18},{"$f":"'test hélices'!C65","v":18},{"$f":"'test hélices'!C78","v":0},"pouces"]
[null,null,null,"poids du quadricoptère",4250,null,null,null,null,null,null,null,null,null,null,"pas",{"$f":"'test hélices'!C14","v":4},{"$f":"'test hélices'!C27","v":6.5},{"$f":"'test hélices'!C40","v":4.7},{"$f":"'test hélices'!C53","v":4},{"$f":"'test hélices'!C66","v":5.5},{"$f":"'test hélices'!C79","v":0},"pouces"]
[null,null,null,null,null,null,null,null,null,null,null,null,null,null,null,"n100W",{"$f":"'test hélices'!C15","v":5700},{"$f":"'test hélices'!C28","v":5100},{"$f":"'test hélices'!C41","v":5350},{"$f":"'test hélices'!C54","v":3450},{"$f":"'test hélices'!C67","v":3020},{"$f":"'test hélices'!C80","v":""}]
[null,"moteur 1:",null,"dans moteurs et mesures n°",8,null,"rendements moteur 1",null,null,null,null,null,null,null,null,"n10N",{"$f":"'test hélices'!C16","v":5857},{"$f":"'test hélices'!C29","v":5100},{"$f":"'test hélices'!C42","v":5500},{"$f":"'test hélices'!C55","v":3200},{"$f":"'test hélices'!C68","v":3150},{"$f":"'test hélices'!C81","v":""}]
[null,null,null,"marque",{"$f":"INDEX('moteurs et mesures'!B:I,moteurs!$E$6+1,1)","v":"Turnigy Multistar"},null,null,null,null,null,null,null,null,null,null," kf",{"$f":"'test hélices'!F13","v":39},{"$f":"'test hélices'!F26","v":45},{"$f":"'test hélices'!F39","v":39},{"$f":"'test hélices'!F52","v":85},{"$f":"'test hélices'!F65","v":90},{"$f":"'test hélices'!F78","v":0}]
[null,null,null,"type",{"$f":"INDEX('moteurs et mesures'!B:I,moteurs!$E$6+1,2)","v":"4014-320KV 22 Poles"},null,{"$f":"IF(Q$7>0,Q$1,\"\")","v":"Helice 1"},{"$f":"IF(R$5>0,R$1,\"\")","v":"Helice 2"},"Helice 3","Helice 4","Helice 5","",null,null,null,"exp_f",{"$f":"'test hélices'!F14","v":1.85},{"$f":"'test hélices'!F27","v":"1,92"},{"$f":"'test hélices'!F40","v":1.91},{"$f":"'test hélices'!F53","v":"2,11"},{"$f":"'test hélices'!F66","v":2.11},{"$f":"'test hélices'!F79","v":0}]
[null,null,null,"puissance",{"$f":"INDEX('moteurs et mesures'!B:I,moteurs!$E$6+1,5)","v":720},"watts",{"$f":"IF(G19>0,G19*100/G22,\"\")","v":86.221232514820883},{"$f":"IF(H19>0,H19*100/H22,\"\")","v":85.834066574708558},86.690744369367536,84.297823815792597,83.842492499118407,"",{"$f":"CONCATENATE(\"% pour \",FIXED($H$1,0),\" grs\")","v":"% pour 1.063 grs"},null,null,"kp",{"$f":"'test hélices'!F15","v":1.6},{"$f":"'test hélices'!F28","v":"1,1"},{"$f":"'test hélices'!F41","v":2.2000000000000002},{"$f":"'test hélices'!F54","v":"2,6"},{"$f":"'test hélices'!F67","v":2.5},{"$f":"'test hélices'!F80","v":0}]
[null,null,null,"KV",{"$f":"INDEX('moteurs et mesures'!B:I,moteurs!$E$6+1,6)","v":320},"KV",{"$f":"IF(G24>0,G24*100/G27,\"\")","v":89.180739635790971},88.787613014532511,89.134737718694254,85.548297012910908,83.278635835376022,"",{"$f":"CONCATENATE(\"% pour \",FIXED($H$2,0),\" grs\")","v":"% pour 1.780 grs"},null,null,"exp_p",{"$f":"'test hélices'!F16","v":2.4300000000000002},{"$f":"'test hélices'!F29","v":"2,8"},{"$f":"'test hélices'!F42","v":2.36},{"$f":"'test hélices'!F55","v":"2,95"},{"$f":"'test hélices'!F68","v":3.27},{"$f":"'test hélices'!F81","v":0}]
[null,null,null,"pour une batterie de",6,"S",{"$f":"IF(G29>0,G29*100/G32,\"\")","v":90.457658181567894},89.757143128764739,90.209732794209657,85.467104822812345,81.755817198840873,"",{"$f":"CONCATENATE(\"% pour \",FIXED($H$3,0),\" grs\")","v":"% pour 2.497 grs"}]
[null,null,null,"avec une résistance interne de ",{"$f":"INDEX('moteurs et mesures'!B:I,moteurs!$E$6+1,3)","v":0.10199999999999999},"ohm(s)",null,null,null,null,null,null,null,null,null,"efficacité électrique pour les 3 valeurs de traction en grs/watt"]
[null,null,null,"courant à vide",{"$f":"INDEX('moteurs et mesures'!B:I,moteurs!$E$6+1,4)","v":0.7},"ampères"]
[null,null,null,"courant maximum",{"$f":"INDEX('moteurs et mesures'!B:I,moteurs!$E$6+1,7)","v":26},"ampères"]
[null,null,null,"poids du moteur",{"$f":"INDEX('moteurs et mesures'!B:I,moteurs!$E$6+1,8)","v":163},"grs"]
[]
[null,null,null,null,null,null,"pour hélice 1","pour hélice 2","pour hélice 3","pour hélice 4","pour hélice 5","pour hélice 6"]
[null,null,null,null,null,"vitesse de rotation en stationnaire",{"$f":"IF(Q$7*Q$8>0,(($H$1+$E$15-MAX($E$15,$E$47,$E$79))/Q$7)^(1/Q$8)*1000,0)","v":5609.5344186986213},{"$f":"IF(R$7*R$8>0,(($H$1+$E$15-MAX($E$15,$E$47,$E$79))/R$7)^(1/R$8)*1000,0)","v":4889.3766271140439},5313.7402391437172,3135.3389595866879,3051.5449204226311,0,"trs/min"]
[null,null,null,null,null,"puissance mécanique en stationnaire",{"$f":" IF((Q$9*Q$10)>0,Q$9*(G18 /1000)^Q$10,0)","v":105.6847071159071},{"$f":" IF((R$9*R$10)>0,R$9*(H18 /1000)^R$10,0)","v":93.60573615230868},113.33588403657227,75.685488798649388,96.010702645859411,{"$f":" IF((V$9*V$10)>0,V$9*(L18 /1000)^V$10,0)","v":0},"watts"]
[null,null,null,null,null,"courant en stationnaire",{"$f":"IF($E10*G18>0,$E10*G19/G18+$E13,0)","v":6.7288615333848165},{"$f":"IF($E10*H18>0,$E10*H19/H18+$E13,0)","v":6.8263097227220637},7.5252269135285115,8.4246373447164675,10.768154212987923,{"$f":"IF($E10*L18>0,$E10*L19/L18+$E13,0)","v":0},"ampères"]
[null,null,null,null,null,"tension en stationnaire",{"$f":"IF(G20-$E13>0,G19/(G20-$E13)+($E12*G20),0)","v":18.21613893483844},{"$f":"IF(H20-$E13>0,H19/(H20-$E13)+($E12*H20),0)","v":15.975585551449038},17.373011392504026,10.657247257869479,10.63442960604549,{"$f":"IF(L20-$E13>0,L19/(L20-$E13)+($E12*L20),0)","v":0},"volts"]
[null,null,null,null,null,"puissance électrique en stationnaire",{"$f":"G20*G21","v":122.57387656542785},{"$f":"H20*H21","v":109.0542949760347},130.73585289990874,89.783443240524377,114.51317796506224,{"$f":"L20*L21","v":0},"watts"]
[null,null,null,null,null,{"$f":"CONCATENATE(\"vitesse de rotation pour \",FIXED(($H$2+$E$15-MAX($E$15,$E$47,$E$79)),0),\" grs\")","v":"vitesse de rotation pour 1.665 grs"},{"$f":"IF(Q$7*Q$8>0,(($H$2+$E$15-MAX($E$15,$E$47,$E$79))/Q$7)^(1/Q$8)*1000,0)","v":7607.992410860038},{"$f":"IF(R$7*R$8>0,(($H$2+$E$15-MAX($E$15,$E$47,$E$79))/R$7)^(1/R$8)*1000,0)","v":6558.0048162827279},7138.1586163630691,4095.6237536718049,3986.1654585273268,0,"trs/min"]
[null,null,null,null,null,{"$f":"CONCATENATE(\"puissance mécanique pour \",FIXED(($H$2+$E$15-MAX($E$15,$E$47,$E$79)),0),\" grs\")","v":"puissance mécanique pour 1.665 grs"},{"$f":" IF((Q$9*Q$10)>0,Q$9*(G23 /1000)^Q$10,0)","v":221.61862420968566},{"$f":" IF((R$9*R$10)>0,R$9*(H23 /1000)^R$10,0)","v":212.98721400110114},{"$f":" IF((S$9*S$10)>0,S$9*(I23 /1000)^S$10,0)","v":227.45008266291026},{"$f":" IF((T$9*T$10)>0,T$9*(J23 /1000)^T$10,0)","v":166.46291855168454},{"$f":" IF((U$9*U$10)>0,U$9*(K23 /1000)^U$10,0)","v":230.01486832827908},0,"watts"]
[null,null,null,null,null,{"$f":"CONCATENATE(\"courant pour \",FIXED(($H$2+$E$15-MAX($E$15,$E$47,$E$79)),0),\" grs\")","v":"courant pour 1.665 grs"},{"$f":"IF($E10*G23>0,$E10*G24/G23+$E13,0)","v":10.021507687871438},11.092781095727396,10.896470877697466,13.706110214294746,19.165053352863655,{"$f":"IF($E10*L23>0,$E10*L24/L23+$E13,0)","v":0},"ampères"]
[null,null,null,null,null,{"$f":"CONCATENATE(\"tension pour \",FIXED(($H$2+$E$15-MAX($E$15,$E$47,$E$79)),0),\" grs\")","v":"tension pour 1.665 grs"},{"$f":"IF(G25-$E13>0,G24/(G25-$E13)+($E12*G25),0)","v":24.79717006810051},21.625228722647723,23.418185705659734,14.196847472082455,14.411602499889987,{"$f":"IF(L25-$E13>0,L24/(L25-$E13)+($E12*L25),0)","v":0},"volts"]
[null,null,null,null,null,{"$f":"CONCATENATE(\"puissance électrique pour \",FIXED(($H$2+$E$15-MAX($E$15,$E$47,$E$79)),0),\" grs\")","v":"puissance électrique pour 1.665 grs"},{"$f":"G25*G26","v":248.50503047492475},239.88392836536778,255.17557855023236,194.58355614789389,276.19913081065482,{"$f":"L25*L26","v":0},"watts"]
[null,null,null,null,null,{"$f":"CONCATENATE(\"vitesse de rotation pour \",FIXED(($H$3+$E$15-MAX($E$15,$E$47,$E$79)),0),\" grs\")","v":"vitesse de rotation pour 2.382 grs"},{"$f":"IF(Q$7*Q$8>0,(($H$3+$E$15-MAX($E$15,$E$47,$E$79))/Q$7)^(1/Q$8)*1000,0)","v":9232.9184586124557},{"$f":"IF(R$7*R$8>0,(($H$3+$E$15-MAX($E$15,$E$47,$E$79))/R$7)^(1/R$8)*1000,0)","v":7902.7027640336019},8610.2193349519366,4853.2177569994301,4723.512253370146,0,"trs/min"]
[null,null,null,null,null,{"$f":"CONCATENATE(\"puissance mécanique pour \",FIXED(($H$3+$E$15-MAX($E$15,$E$47,$E$79)),0),\" grs\")","v":"puissance mécanique pour 2.382 grs"},{"$f":" IF((Q$9*Q$10)>0,Q$9*(G28 /1000)^Q$10,0)","v":354.726597172249},{"$f":" IF((R$9*R$10)>0,R$9*(H28 /1000)^R$10,0)","v":359.05790982434547},{"$f":" IF((S$9*S$10)>0,S$9*(I28 /1000)^S$10,0)","v":354.04317564691877},{"$f":" IF((T$9*T$10)>0,T$9*(J28 /1000)^T$10,0)","v":274.63835735913841},{"$f":" IF((U$9*U$10)>0,U$9*(K28 /1000)^U$10,0)","v":400.66989304064009},0,"watts"]
[null,null,null,null,null,{"$f":"CONCATENATE(\"courant pour \",FIXED(($H$3+$E$15-MAX($E$15,$E$47,$E$79)),0),\" grs\")","v":"courant pour 2.382 grs"},{"$f":"IF(G28>0,$E$10*G29/G28+$E$13,0)","v":12.994326176923542},15.239143704950054,13.85806390054597,18.808454793353423,27.8438622142932,{"$f":"IF(L28>0,$E$10*L29/L28+$E$13,0)","v":0},"ampères"]
[null,null,null,null,null,{"$f":"CONCATENATE(\"tension pour \",FIXED(($H$3+$E$15-MAX($E$15,$E$47,$E$79)),0),\" grs\")","v":"tension pour 2.382 grs"},{"$f":"IF(G30-$E13>0,G29/(G30-$E13)+($E12*G30),0)","v":30.178291453210129},26.250338795509915,28.320457939580489,17.084767879545268,17.601049737639613,{"$f":"IF(L30-$E13>0,L29/(L30-$E13)+($E12*L30),0)","v":0},"volts"]
[null,null,null,null,null,{"$f":"CONCATENATE(\"puissance électrique pour \",FIXED(($H$3+$E$15-MAX($E$15,$E$47,$E$79)),0),\" grs\")","v":"puissance électrique pour 2.382 grs"},{"$f":"G30*G31","v":392.14656260527636},400.03268520840112,392.46671581943087,321.33808431736378,490.08120372175887,{"$f":"L30*L31","v":0},"watts"]
[null,null,null,null,null,"efficacité électrique en stationnaire",{"$f":"IF(G22>0,$H$1/G22,0)","v":8.668241796471662},9.7428533212148167,8.1270743750258703,11.834030436476214,9.2784081175719955,{"$f":"IF(L22>0,$H$1/L22,0)","v":0},"grs/watt"]
[null,null,null,null,null,{"$f":"CONCATENATE(\"efficacité électrique pour \",FIXED(($H$1+$E$15-MAX($E$15,$E$47,$E$79))*(1+$E$1)/2,0),\" grs\")","v":"efficacité électrique pour 1.587 grs"},{"$f":"IF(G27>0,$H$2/G27,0)","v":7.1628328673998807},7.4202553381937193,6.9755891614432048,9.1477411310496599,6.4446256393915258,{"$f":"IF(L27>0,$H$2/L27,0)","v":0},"grs/watt"]
[null,null,null,null,null,{"$f":"CONCATENATE(\"efficacité électrique pour \",FIXED(($H$3+$E$15-MAX($E$15,$E$47,$E$79)),0),\" grs\")","v":"efficacité électrique pour 2.382 grs"},{"$f":"IF(G32>0,$H$3/G32,0)","v":6.3675172451107507},6.2419899481442682,6.3623229674050608,7.7706319974630924,5.0950740020987606,{"$f":"IF(L32>0,$H$3/L32,0)","v":0},"grs/watt",null,null,{"$f":"$H$1+$E$15-MAX($E$15,$E$47,$E$79)","v":947.5},"grs",null,null,{"$f":"($H$1+$E$15-MAX($E$15,$E$47,$E$79))*(1+$E$1)/2","v":1587.0625},"grs",null,null,{"$f":"($H$1+$E$15-MAX($E$15,$E$47,$E$79))*$E$1","v":2226.625},"grs"]
[]
[]
[null,"moteur 2:",null,"dans moteurs et mesures n°",14,null,"rendements moteur 2"]
[null,null,null,"marque",{"$f":"INDEX('moteurs et mesures'!B:I,moteurs!$E$38+1,1)","v":"Turnigy Multistar"}]
[null,null,null,"type",{"$f":"INDEX('moteurs et mesures'!B:I,moteurs!$E$38+1,2)","v":"4230-400Kv 16 Poles"},null,{"$f":"IF(Q$7>0,Q$1,\"\")","v":"Helice 1"},{"$f":"IF(R$5>0,R$1,\"\")","v":"Helice 2"},"Helice 3","Helice 4","Helice 5","",null,null,null,"efficacité électrique pour les 3 valeurs de traction en grs/watt"]
[null,null,null,"puissance",{"$f":"INDEX('moteurs et mesures'!B:I,moteurs!$E$38+1,5)","v":550},"watts",{"$f":"IF(G51>0,G51*100/G54,\"\")","v":81.225981299294986},79.752249909189274,80.140317097281908,71.725744110879319,67.666339050001554,"",{"$f":"CONCATENATE(\"% pour \",FIXED($H$1,0),\" grs\")","v":"% pour 1.063 grs"}]
[null,null,null,"KV",{"$f":"INDEX('moteurs et mesures'!B:I,moteurs!$E$38+1,6)","v":400},"KV",{"$f":"IF(G56>0,G56*100/G59,\"\")","v":82.353701885080397},79.748612155779497,80.960887580469347,69.215074753513434,62.237458602551087,"",{"$f":"CONCATENATE(\"% pour \",FIXED($H$2,0),\" grs\")","v":"% pour 1.780 grs"}]
[null,null,null,"pour une batterie de",6,"S",{"$f":"IF(G61>0,G61*100/G64,\"\")","v":85.994506257624366},83.606581298108622,85.061552059400896,74.561598111400272,67.385917872673005,"",{"$f":"CONCATENATE(\"% pour \",FIXED($H$3,0),\" grs\")","v":"% pour 2.497 grs"}]
[null,null,null,"avec une résistance interne de ",{"$f":"INDEX('moteurs et mesures'!B:I,moteurs!$E$38+1,3)","v":0.24},"ohm(s)"]
[null,null,null,"courant à vide",{"$f":"INDEX('moteurs et mesures'!B:I,moteurs!$E$38+1,4)","v":0.6},"ampères"]
[null,null,null,"courant maximum",{"$f":"INDEX('moteurs et mesures'!B:I,moteurs!$E$38+1,7)","v":25},"ampères"]
[null,null,null,"poids du moteur",{"$f":"INDEX('moteurs et mesures'!B:I,moteurs!$E$38+1,8)","v":138},"grs"]
[]
[null,null,null,null,null,null,"pour hélice 1","pour hélice 2","pour hélice 3","pour hélice 4","pour hélice 5","pour hélice 6"]
[null,null,null,null,null,"vitesse de rotation en stationnaire",{"$f":"IF(Q$7*Q$8>0,(($H$1+$E$47-MAX($E$15,$E$47,$E$79))/Q$7)^(1/Q$8)*1000,0)","v":5529.038374910253},{"$f":"IF(R$7*R$8>0,(($H$1+$E$47-MAX($E$15,$E$47,$E$79))/R$7)^(1/R$8)*1000,0)","v":4821.7549607431301},5239.8674049017764,3095.8562122446338,3013.1173760170773,0,"trs/min"]
[null,null,null,null,null,"puissance mécanique en stationnaire",{"$f":" IF((Q$9*Q$10)>0,Q$9*(G50 /1000)^Q$10,0)","v":102.03719724382017},{"$f":" IF((R$9*R$10)>0,R$9*(H50 /1000)^R$10,0)","v":90.025815860953344},{"$f":" IF((S$9*S$10)>0,S$9*(I50 /1000)^S$10,0)","v":109.65251127774354},{"$f":" IF((T$9*T$10)>0,T$9*(J50 /1000)^T$10,0)","v":72.908246561607044},{"$f":" IF((U$9*U$10)>0,U$9*(K50 /1000)^U$10,0)","v":92.113331948098931},{"$f":" IF((V$9*V$10)>0,V$9*(L50 /1000)^V$10,0)","v":0},"watts"]
[null,null,null,null,null,"courant en stationnaire",{"$f":"IF($E42*G50>0,$E42*G51/G50+$E45,0)","v":7.9819127540764399},{"$f":"IF($E42*H50>0,$E42*H51/H50+$E45,0)","v":8.0683028560272199},{"$f":"IF($E42*I50>0,$E42*I51/I50+$E45,0)","v":8.9706325221257401},{"$f":"IF($E42*J50>0,$E42*J51/J50+$E45,0)","v":10.020107597147778},{"$f":"IF($E42*K50>0,$E42*K51/K50+$E45,0)","v":12.828309813786273},{"$f":"IF($E42*L50>0,$E42*L51/L50+$E45,0)","v":0},"ampères"]
[null,null,null,null,null,"tension en stationnaire",{"$f":"IF(G52-$E45>0,G51/(G52-$E45)+($E44*G52),0)","v":15.738254998253979},{"$f":"IF(H52-$E45>0,H51/(H52-$E45)+($E44*H52),0)","v":13.990780087304358},15.252620317564618,10.144466353927051,10.611587795351399,0,"volts"]
[null,null,null,null,null,"puissance électrique en stationnaire",{"$f":"G52*G53","v":125.62137829747071},{"$f":"H52*H53","v":112.88185093644651},136.82565186838099,101.64864438199446,136.12873585496098,0,"watts"]
[null,null,null,null,null,{"$f":"CONCATENATE(\"vitesse de rotation pour \",FIXED(($H$2+$E$47-MAX($E$15,$E$47,$E$79)),0),\" grs\")","v":"vitesse de rotation pour 1.640 grs"},{"$f":"IF(Q$7*Q$8>0,(($H$2+$E$47-MAX($E$15,$E$47,$E$79))/Q$7)^(1/Q$8)*1000,0)","v":7546.0296735232205},{"$f":"IF(R$7*R$8>0,(($H$2+$E$47-MAX($E$15,$E$47,$E$79))/R$7)^(1/R$8)*1000,0)","v":6506.5332467998842},7081.8414507791504,4066.3628059853877,3957.686529317386,0,"trs/min"]
[null,null,null,null,null,{"$f":"CONCATENATE(\"puissance mécanique pour \",FIXED(($H$2+$E$47-MAX($E$15,$E$47,$E$79)),0),\" grs\")","v":"puissance mécanique pour 1.640 grs"},{"$f":" IF((Q$9*Q$10)>0,Q$9*(G55 /1000)^Q$10,0)","v":217.25809076714813},{"$f":" IF((R$9*R$10)>0,R$9*(H55 /1000)^R$10,0)","v":208.33954641505829},{"$f":" IF((S$9*S$10)>0,S$9*(I55 /1000)^S$10,0)","v":223.23778853861671},{"$f":" IF((T$9*T$10)>0,T$9*(J55 /1000)^T$10,0)","v":162.97891218265221},{"$f":" IF((U$9*U$10)>0,U$9*(K55 /1000)^U$10,0)","v":224.68462904971665},{"$f":" IF((V$9*V$10)>0,V$9*(L55 /1000)^V$10,0)","v":0},"watts"]
[null,null,null,null,null,{"$f":"CONCATENATE(\"courant pour \",FIXED(($H$2+$E$47-MAX($E$15,$E$47,$E$79)),0),\" grs\")","v":"courant pour 1.640 grs"},{"$f":"IF($E42*G55>0,$E42*G56/G55+$E45,0)","v":12.116418575953514},13.408021630721777,13.209024931731895,16.631910575491123,23.308683710578748,0,"ampères"]
[null,null,null,null,null,{"$f":"CONCATENATE(\"tension pour \",FIXED(($H$2+$E$47-MAX($E$15,$E$47,$E$79)),0),\" grs\")","v":"tension pour 1.640 grs"},{"$f":"IF(G57-$E45>0,G56/(G57-$E45)+($E44*G57),0)","v":21.773014642036895},19.484258308372937,20.874769610563529,14.157565553081339,15.488300413832365,0,"volts"]
[null,null,null,null,null,{"$f":"CONCATENATE(\"puissance électrique pour \",FIXED(($H$2+$E$47-MAX($E$15,$E$47,$E$79)),0),\" grs\")","v":"puissance électrique pour 1.640 grs"},{"$f":"G57*G58","v":263.81095906328369},261.24535685723481,275.73535223009293,235.46736424550235,361.01189556044454,0,"watts"]
[null,null,null,null,null,{"$f":"CONCATENATE(\"vitesse de rotation pour \",FIXED(($H$3+$E$47-MAX($E$15,$E$47,$E$79)),0),\" grs\")","v":"vitesse de rotation pour 2.357 grs"},{"$f":"IF(Q$7*Q$8>0,(($H$3+$E$47-MAX($E$15,$E$47,$E$79))/Q$7)^(1/Q$8)*1000,0)","v":9180.4115125807366},{"$f":"IF(R$7*R$8>0,(($H$3+$E$47-MAX($E$15,$E$47,$E$79))/R$7)^(1/R$8)*1000,0)","v":7859.3946755805864},8562.7875790937996,4829.0102940313545,4699.9517511058893,0,"trs/min"]
[null,null,null,null,null,{"$f":"CONCATENATE(\"puissance mécanique pour \",FIXED(($H$3+$E$47-MAX($E$15,$E$47,$E$79)),0),\" grs\")","v":"puissance mécanique pour 2.357 grs"},{"$f":" IF((Q$9*Q$10)>0,Q$9*(G60 /1000)^Q$10,0)","v":349.84446285238869},{"$f":" IF((R$9*R$10)>0,R$9*(H60 /1000)^R$10,0)","v":353.57549692569887},{"$f":" IF((S$9*S$10)>0,S$9*(I60 /1000)^S$10,0)","v":349.45759441881449},{"$f":" IF((T$9*T$10)>0,T$9*(J60 /1000)^T$10,0)","v":270.61685028884142},{"$f":" IF((U$9*U$10)>0,U$9*(K60 /1000)^U$10,0)","v":394.17168625101669},{"$f":" IF((V$9*V$10)>0,V$9*(L60 /1000)^V$10,0)","v":0},"watts"]
[null,null,null,null,null,{"$f":"CONCATENATE(\"courant pour \",FIXED(($H$3+$E$47-MAX($E$15,$E$47,$E$79)),0),\" grs\")","v":"courant pour 2.357 grs"},{"$f":"IF(G60>0,$E$10*G61/G60+$E$13,0)","v":12.894467313295161},15.096039858866801,13.759582429330242,18.632741249167228,27.537496697842915,0,"ampères"]
[null,null,null,null,null,{"$f":"CONCATENATE(\"tension pour \",FIXED(($H$3+$E$47-MAX($E$15,$E$47,$E$79)),0),\" grs\")","v":"tension pour 2.357 grs"},{"$f":"IF(G62-$E45>0,G61/(G62-$E45)+($E44*G62),0)","v":31.550111007272623},28.014228147872007,29.857670844049444,19.47883030347386,21.241824620787352,0,"volts"]
[null,null,null,null,null,{"$f":"CONCATENATE(\"puissance électrique pour \",FIXED(($H$3+$E$47-MAX($E$15,$E$47,$E$79)),0),\" grs\")","v":"puissance électrique pour 2.357 grs"},{"$f":"G62*G63","v":406.8218751141107},422.90390473566413,410.82908312650858,362.94400488106601,584.94667535108999,0,"watts"]
[null,null,null,null,null,"efficacité électrique en stationnaire",{"$f":"IF(G54>0,$H$1/G54,0)","v":8.4579552811783838},9.4124962621156616,7.7653567550481588,10.452672600405146,7.805111781336497,0,"grs/watt"]
[null,null,null,null,null,{"$f":"CONCATENATE(\"efficacité électrique pour \",FIXED(($H$1+$E$47-MAX($E$15,$E$47,$E$79))*(1+$E$1)/2,0),\" grs\")","v":"efficacité électrique pour 1.545 grs"},{"$f":"IF(G59>0,$H$2/G59,0)","v":6.747255710377857},6.8135182244510979,6.4554653061484952,7.5594340035340997,4.9305854513095211,0,"grs/watt"]
[null,null,null,null,null,{"$f":"CONCATENATE(\"efficacité électrique pour \",FIXED(($H$1+$E$47-MAX($E$15,$E$47,$E$79))*$E$1,0),\" grs\")","v":"efficacité électrique pour 2.168 grs"},{"$f":"IF(G64>0,$H$3/G64,0)","v":6.1378213728050115},5.9044146247851472,6.0779533449706795,6.8798491404156072,4.2687651801786535,0,"grs/watt",null,null,{"$f":"$H$1+$E$47-MAX($E$15,$E$47,$E$79)","v":922.5},"grs",null,null,{"$f":"($H$1+$E$47-MAX($E$15,$E$47,$E$79))*(1+$E$1)/2","v":1545.1875},"grs",null,null,{"$f":"($H$1+$E$47-MAX($E$15,$E$47,$E$79))*E1","v":2167.875},"grs"]
[]
[]
[null,"moteur 3:",null,"dans moteurs et mesures n°",15,null,"rendements moteur 3"]
[null,null,null,"marque",{"$f":"INDEX('moteurs et mesures'!B:I,moteurs!$E$70+1,1)","v":"Turnigy"}]
[null,null,null,"type",{"$f":"INDEX('moteurs et mesures'!B:I,moteurs!$E$70+1,2)","v":"4260 500KV"},null,{"$f":"IF(Q$7>0,Q$1,\"\")","v":"Helice 1"},{"$f":"IF(R$5>0,R$1,\"\")","v":"Helice 2"},"Helice 3","Helice 4","Helice 5","",null,null,null,"efficacité électrique pour les 3 valeurs de traction en grs/watt"]
[null,null,null,"puissance",{"$f":"INDEX('moteurs et mesures'!B:I,moteurs!$E$70+1,5)","v":1000},"watts",{"$f":"IF(G83>0,G83*100/G86,\"\")","v":86.719892152608637},86.774428402027013,87.575720269575172,87.10288271994348,87.933370990417274,"",{"$f":"CONCATENATE(\"% pour \",FIXED($H$1,0),\" grs\")","v":"% pour 1.063 grs"}]
[null,null,null,"KV",{"$f":"INDEX('moteurs et mesures'!B:I,moteurs!$E$70+1,6)","v":500},"KV",{"$f":"IF(G88>0,G88*100/G91,\"\")","v":90.04385596893016},90.349751559740241,90.374377635839892,89.461565906610758,89.136993163391679,"",{"$f":"CONCATENATE(\"% pour \",FIXED($H$2,0),\" grs\")","v":"% pour 1.780 grs"}]
[null,null,null,"pour une batterie de",6,"S",{"$f":"IF(G93>0,G93*100/G96,\"\")","v":89.158974723436643},90.412460292780125,89.65355379293122,90.957070190334377,92.040298316765714,{"$f":"IF(L93>0,L93*100/L96,\"\")","v":""},{"$f":"CONCATENATE(\"% pour \",FIXED($H$3,0),\" grs\")","v":"% pour 2.497 grs"}]
[null,null,null,"avec une résistance interne de ",{"$f":"INDEX('moteurs et mesures'!B:I,moteurs!$E$70+1,3)","v":1.9E-2},"ohm(s)"]
[null,null,null,"courant à vide",{"$f":"INDEX('moteurs et mesures'!B:I,moteurs!$E$70+1,4)","v":1.36},"ampères"]
[null,null,null,"courant maximum",{"$f":"INDEX('moteurs et mesures'!B:I,moteurs!$E$70+1,7)","v":0},"ampères"]
[null,null,null,"poids du moteur",{"$f":"INDEX('moteurs et mesures'!B:I,moteurs!$E$70+1,8)","v":278},"grs"]
[]
[null,null,null,null,null,null,"pour hélice 1","pour hélice 2","pour hélice 3","pour hélice 4","pour hélice 5","pour hélice 6"]
[null,null,null,null,null,"vitesse de rotation en stationnaire",{"$f":"IF(Q$7*Q$8>0,(($H$1+$E$79-MAX($E$15,$E$47,$E$79))/Q$7)^(1/Q$8)*1000,0)","v":5967.8590546058322},{"$f":"IF(R$7*R$8>0,(($H$1+$E$79-MAX($E$15,$E$47,$E$79))/R$7)^(1/R$8)*1000,0)","v":5189.9694884226647},5642.184637150599,3310.2635001316953,3221.7944851547782,0,"trs/min"]
[null,null,null,null,null,"puissance mécanique en stationnaire",{"$f":" IF((Q$9*Q$10)>0,Q$9*(G82 /1000)^Q$10,0)","v":122.8454506406697},{"$f":" IF((R$9*R$10)>0,R$9*(H82 /1000)^R$10,0)","v":110.62521766143941},{"$f":" IF((S$9*S$10)>0,S$9*(I82 /1000)^S$10,0)","v":130.56846391808753},{"$f":" IF((T$9*T$10)>0,T$9*(J82 /1000)^T$10,0)","v":88.831688239372269},{"$f":" IF((U$9*U$10)>0,U$9*(K82 /1000)^U$10,0)","v":114.66210888863742},{"$f":" IF((V$9*V$10)>0,V$9*(L82 /1000)^V$10,0)","v":0},"watts"]
[null,null,null,null,null,"courant en stationnaire",{"$f":"IF($E74*G82>0,$E74*G83/G82+$E77,0)","v":11.652254686030236},{"$f":"IF($E74*H82>0,$E74*H83/H82+$E77,0)","v":12.01759807530782},12.930736542222309,14.777615884028293,19.154758389613566,{"$f":"IF($E74*L82>0,$E74*L83/L82+$E77,0)","v":0},"ampères"]
[null,null,null,null,null,"tension en stationnaire",{"$f":"IF(G84-$E77>0,G83/(G84-$E77)+($E76*G84),0)","v":12.157110948246238},{"$f":"IF(H84-$E77>0,H83/(H84-$E77)+($E76*H84),0)","v":10.608273340276178},11.530053268603423,6.9013017020599285,6.8075293797122143,0,"volts"]
[null,null,null,null,null,"puissance électrique en stationnaire",{"$f":"G84*G85","v":141.65775301529172},{"$f":"H84*H85","v":127.48596527644224},149.09208113410006,101.9847856528323,130.39658049858338,0,"watts"]
[null,null,null,null,null,{"$f":"CONCATENATE(\"vitesse de rotation pour \",FIXED(($H$2+$E$79-MAX($E$15,$E$47,$E$79)),0),\" grs\")","v":"vitesse de rotation pour 1.780 grs"},{"$f":"IF(Q$7*Q$8>0,(($H$2+$E$79-MAX($E$15,$E$47,$E$79))/Q$7)^(1/Q$8)*1000,0)","v":7887.6723569832184},{"$f":"IF(R$7*R$8>0,(($H$2+$E$79-MAX($E$15,$E$47,$E$79))/R$7)^(1/R$8)*1000,0)","v":6790.1426823869797},7392.1787204728325,4227.3369038272922,4114.3584862957914,0,"trs/min"]
[null,null,null,null,null,{"$f":"CONCATENATE(\"puissance mécanique pour \",FIXED(($H$2+$E$79-MAX($E$15,$E$47,$E$79)),0),\" grs\")","v":"puissance mécanique pour 1.780 grs"},{"$f":" IF((Q$9*Q$10)>0,Q$9*(G87 /1000)^Q$10,0)","v":241.93890909646655},{"$f":" IF((R$9*R$10)>0,R$9*(H87 /1000)^R$10,0)","v":234.7759496646527},{"$f":" IF((S$9*S$10)>0,S$9*(I87 /1000)^S$10,0)","v":247.01633986532846},{"$f":" IF((T$9*T$10)>0,T$9*(J87 /1000)^T$10,0)","v":182.7555555065824},{"$f":" IF((U$9*U$10)>0,U$9*(K87 /1000)^U$10,0)","v":255.09853913454259},0,"watts"]
[null,null,null,null,null,{"$f":"CONCATENATE(\"courant pour \",FIXED(($H$2+$E$79-MAX($E$15,$E$47,$E$79)),0),\" grs\")","v":"courant pour 1.780 grs"},{"$f":"IF($E74*G87>0,$E74*G88/G87+$E77,0)","v":16.696521228741837},{"$f":"IF($E74*H87>0,$E74*H88/H87+$E77,0)","v":18.647998253235563},{"$f":"IF($E74*I87>0,$E74*I88/I87+$E77,0)","v":18.067952364653348},{"$f":"IF($E74*J87>0,$E74*J88/J87+$E77,0)","v":22.97592033759144},{"$f":"IF($E74*K87>0,$E74*K88/K87+$E77,0)","v":32.361010240628183},0,"ampères"]
[null,null,null,null,null,{"$f":"CONCATENATE(\"tension pour \",FIXED(($H$2+$E$79-MAX($E$15,$E$47,$E$79)),0),\" grs\")","v":"tension pour 1.780 grs"},{"$f":"IF(G89-$E77>0,G88/(G89-$E77)+($E76*G89),0)","v":16.09257861731253},{"$f":"IF(H89-$E77>0,H88/(H89-$E77)+($E76*H89),0)","v":13.934597331585435},{"$f":"IF(I89-$E77>0,I88/(I89-$E77)+($E76*I89),0)","v":15.12764853587408},{"$f":"IF(J89-$E77>0,J88/(J89-$E77)+($E76*J89),0)","v":8.8912162940688226},{"$f":"IF(K89-$E77>0,K88/(K89-$E77)+($E76*K89),0)","v":8.8435761671635191},0,"volts"]
[null,null,null,null,null,{"$f":"CONCATENATE(\"puissance électrique pour \",FIXED(($H$2+$E$79-MAX($E$15,$E$47,$E$79)),0),\" grs\")","v":"puissance électrique pour 1.780 grs"},{"$f":"G89*G90","v":268.69008050915562},{"$f":"H89*H90","v":259.85234669894612},273.32563313539083,204.28387727682025,286.18705890935399,0,"watts"]
[null,null,null,null,null,{"$f":"CONCATENATE(\"vitesse de rotation pour \",FIXED(($H$3+$E$79-MAX($E$15,$E$47,$E$79)),0),\" grs\")","v":"vitesse de rotation pour 2.497 grs"},{"$f":"IF(Q$7*Q$8>0,(($H$3+$E$79-MAX($E$15,$E$47,$E$79))/Q$7)^(1/Q$8)*1000,0)","v":9471.2550671853824},{"$f":"IF(R$7*R$8>0,(($H$3+$E$79-MAX($E$15,$E$47,$E$79))/R$7)^(1/R$8)*1000,0)","v":8099.172332343187},8825.4131340952972,4962.8873269539326,4830.2508304213843,0,"trs/min"]
[null,null,null,null,null,{"$f":"CONCATENATE(\"puissance mécanique pour \",FIXED(($H$3+$E$79-MAX($E$15,$E$47,$E$79)),0),\" grs\")","v":"puissance mécanique pour 2.497 grs"},{"$f":" IF((Q$9*Q$10)>0,Q$9*(G92 /1000)^Q$10,0)","v":377.38991202080899},{"$f":" IF((R$9*R$10)>0,R$9*(H92 /1000)^R$10,0)","v":384.61522945871462},{"$f":" IF((S$9*S$10)>0,S$9*(I92 /1000)^S$10,0)","v":375.28169912068375},{"$f":" IF((T$9*T$10)>0,T$9*(J92 /1000)^T$10,0)","v":293.35255397073706},{"$f":" IF((U$9*U$10)>0,U$9*(K92 /1000)^U$10,0)","v":431.04327607802657},0,"watts"]
[null,null,null,null,null,{"$f":"CONCATENATE(\"courant pour \",FIXED(($H$3+$E$79-MAX($E$15,$E$47,$E$79)),0),\" grs\")","v":"courant pour 2.497 grs"},{"$f":"IF(G92>0,$E$10*G93/G92+$E$13,0)","v":13.450661975630554},{"$f":"IF(H92>0,$E$10*H93/H92+$E$13,0)","v":15.89622850044741},14.307311283216134,19.614960402345481,29.2562496001756,0,"ampères"]
[null,null,null,null,null,{"$f":"CONCATENATE(\"tension pour \",FIXED(($H$3+$E$79-MAX($E$15,$E$47,$E$79)),0),\" grs\")","v":"tension pour 2.497 grs"},{"$f":"IF(G94-$E77>0,G93/(G94-$E77)+($E76*G94),0)","v":31.468900009470875},{"$f":"IF(H94-$E77>0,H93/(H94-$E77)+($E76*H94),0)","v":26.761108112225955},{"$f":"IF(I94-$E77>0,I93/(I94-$E77)+($E76*I94),0)","v":29.257138712275758},{"$f":"IF(J94-$E77>0,J93/(J94-$E77)+($E76*J94),0)","v":16.442428991273029},{"$f":"IF(K94-$E77>0,K93/(K94-$E77)+($E76*K94),0)","v":16.007525587175518},0,"volts"]
[null,null,null,null,null,{"$f":"CONCATENATE(\"puissance électrique pour \",FIXED(($H$3+$E$79-MAX($E$15,$E$47,$E$79)),0),\" grs\")","v":"puissance électrique pour 2.497 grs"},{"$f":"G94*G95","v":423.27753677230987},{"$f":"H94*H95","v":425.40068947712064},418.59099081276247,322.51759358219783,468.32016405960445,0,"watts"]
[null,null,null,null,null,"efficacité électrique en stationnaire",{"$f":"IF(G86>0,$H$1/G86,0)","v":7.5004719288841528},{"$f":"IF(H86>0,$H$1/H86,0)","v":8.334250736510965},7.1264683671853781,10.418220651233897,8.1482198071255638,0,"grs/watt"]
[null,null,null,null,null,{"$f":"CONCATENATE(\"efficacité électrique pour \",FIXED(($H$2+$E$79-MAX($E$15,$E$47,$E$79)),0),\" grs\")","v":"efficacité électrique pour 1.780 grs"},{"$f":"IF(G91>0,$H$2/G91,0)","v":6.6247328395115295},{"$f":"IF(H91>0,$H$2/H91,0)","v":6.8500439677084479},6.5123785851372515,8.7133650669257872,6.2197082103694692,0,"grs/watt"]
[null,null,null,null,null,{"$f":"CONCATENATE(\"efficacité électrique pour \",FIXED(($H$3+$E$79-MAX($E$15,$E$47,$E$79)),0),\" grs\")","v":"efficacité électrique pour 2.497 grs"},{"$f":"IF(G96>0,$H$3/G96,0)","v":5.8992027288780751},{"$f":"IF(H96>0,$H$3/H96,0)","v":5.8697601150321983},5.9652502199143571,7.7422132921986062,5.3318225257586809,0,"grs/watt"]
[null,null,null,null,null,null,null,null,null,null,null,null,null,null,null,{"$f":"($H$1+$E$79-MAX($E$15,$E$47,$E$79))","v":1062.5},"grs",null,null,{"$f":"($H$1+$E$79-MAX($E$15,$E$47,$E$79))*(1+$E$1)/2","v":1779.6875},"grs",null,null,{"$f":"($H$1+$E$79-MAX($E$15,$E$47,$E$79))*E1","v":2496.875},"grs"]

{"sheet":"moteur-hélice","index":8,"n_rows":54,"n_cols":37,"rows_kept":54,"cut":false,"hidden":false,"merged":[]}
[null,null,null,null,null,{"$f":"'mesures hélices'!B10","v":"Helice 1"},null,null,{"$f":"'mesures hélices'!B25","v":"Helice 2"},null,null,{"$f":"'mesures hélices'!B40","v":"Helice 3"},null,null,{"$f":"'mesures hélices'!B55","v":"Helice 4"},null,null,{"$f":"'mesures hélices'!B70","v":"Helice 5"},null,null,{"$f":"'mesures hélices'!B85","v":"Helice 6"}]
[null,null,null,null,null,{"$f":"'mesures hélices'!B11","v":"marque"},{"$f":"'test hélices'!C12","v":"RCTimer"},null,{"$f":"'mesures hélices'!B26","v":"marque"},{"$f":"'test hélices'!C25","v":"RCTimer"},null,{"$f":"'mesures hélices'!B41","v":"marque"},{"$f":"'test hélices'!C38","v":"RCTimer"},null,{"$f":"'mesures hélices'!B56","v":"marque"},{"$f":"'test hélices'!C51","v":"RCTimer"},null,{"$f":"'mesures hélices'!B71","v":"marque"},{"$f":"'test hélices'!C64","v":"HK"},null,{"$f":"'mesures hélices'!B86","v":"marque"},{"$f":"'test hélices'!C77","v":""}]
[null,null,null,null,null,{"$f":"'mesures hélices'!B12","v":"diamètre"},{"$f":"'test hélices'!C13","v":13},null,{"$f":"'mesures hélices'!B27","v":"diamètre"},{"$f":"'test hélices'!C26","v":13},null,{"$f":"'mesures hélices'!B42","v":"diamètre"},{"$f":"'test hélices'!C39","v":14},null,{"$f":"'mesures hélices'!B57","v":"diamètre"},{"$f":"'test hélices'!C52","v":18},null,{"$f":"'mesures hélices'!B72","v":"diamètre"},{"$f":"'test hélices'!C65","v":18},null,{"$f":"'mesures hélices'!B87","v":"diamètre"},{"$f":"'test hélices'!C78","v":0}]
[null,null,null,null,null,{"$f":"'mesures hélices'!B13","v":"pas"},{"$f":"'test hélices'!C14","v":4},null,{"$f":"'mesures hélices'!B28","v":"pas"},{"$f":"'test hélices'!C27","v":6.5},null,{"$f":"'mesures hélices'!B43","v":"pas"},{"$f":"'test hélices'!C40","v":4.7},null,{"$f":"'mesures hélices'!B58","v":"pas"},{"$f":"'test hélices'!C53","v":4},null,{"$f":"'mesures hélices'!B73","v":"pas"},{"$f":"'test hélices'!C66","v":5.5},null,{"$f":"'mesures hélices'!B88","v":"pas"},{"$f":"'test hélices'!C79","v":0}]
[null,null,null,null,null,{"$f":"'mesures hélices'!B14","v":"n100W"},{"$f":"'test hélices'!C15","v":5700},null,{"$f":"'mesures hélices'!B29","v":"n100W"},{"$f":"'test hélices'!C28","v":5100},null,{"$f":"'mesures hélices'!B44","v":"n100W"},{"$f":"'test hélices'!C41","v":5350},null,{"$f":"'mesures hélices'!B59","v":"n100W"},{"$f":"'test hélices'!C54","v":3450},null,{"$f":"'mesures hélices'!B74","v":"n100W"},{"$f":"'test hélices'!C67","v":3020},null,{"$f":"'mesures hélices'!B89","v":"n100W"},{"$f":"'test hélices'!C80","v":""}]
[null,null,null,null,null,{"$f":"'mesures hélices'!B15","v":"n10N"},{"$f":"'test hélices'!C16","v":5857},null,{"$f":"'mesures hélices'!B30","v":"n10N"},{"$f":"'test hélices'!C29","v":5100},null,{"$f":"'mesures hélices'!B45","v":"n10N"},{"$f":"'test hélices'!C42","v":5500},null,{"$f":"'mesures hélices'!B60","v":"n10N"},{"$f":"'test hélices'!C55","v":3200},null,{"$f":"'mesures hélices'!B75","v":"n10N"},{"$f":"'test hélices'!C68","v":3150},null,{"$f":"'mesures hélices'!B90","v":"n10N"},{"$f":"'test hélices'!C81","v":""}]
[null,null,null,null,null,{"$f":"'test hélices'!E78","v":" kf"},{"$f":"'test hélices'!F13","v":39},null,{"$f":"'test hélices'!E26","v":" kf"},{"$f":"'test hélices'!F26","v":45},null,{"$f":"'test hélices'!E26","v":" kf"},{"$f":"'test hélices'!F39","v":39},null,{"$f":"'test hélices'!E52","v":" kf"},{"$f":"'test hélices'!F52","v":85},null,{"$f":"'test hélices'!E65","v":" kf"},{"$f":"'test hélices'!F65","v":90},null,{"$f":"'test hélices'!E78","v":" kf"},{"$f":"'test hélices'!F78","v":0}]
[null,null,null,null,null,{"$f":"'test hélices'!E79","v":"exp_f"},{"$f":"'test hélices'!F14","v":1.85},null,{"$f":"'test hélices'!E27","v":"exp_f"},{"$f":"'test hélices'!F27","v":"1,92"},null,{"$f":"'test hélices'!E27","v":"exp_f"},{"$f":"'test hélices'!F40","v":1.91},null,{"$f":"'test hélices'!E53","v":"exp_f"},{"$f":"'test hélices'!F53","v":"2,11"},null,{"$f":"'test hélices'!E66","v":"exp_f"},{"$f":"'test hélices'!F66","v":2.11},null,{"$f":"'test hélices'!E79","v":"exp_f"},{"$f":"'test hélices'!F79","v":0}]
[null,null,null,null,null,{"$f":"'test hélices'!E80","v":"kp"},{"$f":"'test hélices'!F15","v":1.6},null,{"$f":"'test hélices'!E28","v":"kp"},{"$f":"'test hélices'!F28","v":"1,1"},null,{"$f":"'test hélices'!E28","v":"kp"},{"$f":"'test hélices'!F41","v":2.2000000000000002},null,{"$f":"'test hélices'!E54","v":"kp"},{"$f":"'test hélices'!F54","v":"2,6"},null,{"$f":"'test hélices'!E67","v":"kp"},{"$f":"'test hélices'!F67","v":2.5},null,{"$f":"'test hélices'!E80","v":"kp"},{"$f":"'test hélices'!F80","v":0}]
[null,null,null,null,null,{"$f":"'test hélices'!E81","v":"exp_p"},{"$f":"'test hélices'!F16","v":2.4300000000000002},null,{"$f":"'test hélices'!E29","v":"exp_p"},{"$f":"'test hélices'!F29","v":"2,8"},null,{"$f":"'test hélices'!E29","v":"exp_p"},{"$f":"'test hélices'!F42","v":2.36},null,{"$f":"'test hélices'!E55","v":"exp_p"},{"$f":"'test hélices'!F55","v":"2,95"},null,{"$f":"'test hélices'!E68","v":"exp_p"},{"$f":"'test hélices'!F68","v":3.27},null,{"$f":"'test hélices'!E81","v":"exp_p"},{"$f":"'test hélices'!F81","v":0}]
[]
[]
[null,null,null,null,"efficacité des couples moteur-hélice en grs/Watt pour différentes forces de traction"]
[]
[null,null,null,null,"efficacité","hélice 1","hélice 2","hélice 3","hélice 4","hélice 5","hélice 6",null,{"$f":"CONCATENATE(\"pour traction de \",FIXED(moteurs!H1,0),\" grs\")","v":"pour traction de 1.063 grs"}]
[null,null,null,null,"moteur 1",{"$f":"moteurs!G33","v":8.668241796471662},{"$f":"moteurs!H33","v":9.7428533212148167},{"$f":"moteurs!I33","v":8.1270743750258703},{"$f":"moteurs!J33","v":11.834030436476214},{"$f":"moteurs!K33","v":9.2784081175719955},{"$f":"moteurs!L33","v":0},"moteur 1",{"$f":"CONCATENATE(moteurs!E7,\" \",moteurs!E8)","v":"Turnigy Multistar 4014-320KV 22 Poles"}]
[null,null,null,null,"moteur 2",{"$f":"moteurs!G65","v":8.4579552811783838},{"$f":"moteurs!H65","v":9.4124962621156616},{"$f":"moteurs!I65","v":7.7653567550481588},{"$f":"moteurs!J65","v":10.452672600405146},{"$f":"moteurs!K65","v":7.805111781336497},{"$f":"moteurs!L65","v":0},"moteur 2",{"$f":"CONCATENATE(moteurs!E39,\" \",moteurs!E40)","v":"Turnigy Multistar 4230-400Kv 16 Poles"}]
[null,null,null,null,"moteur 3",{"$f":"moteurs!G97","v":7.5004719288841528},{"$f":"moteurs!H97","v":8.334250736510965},{"$f":"moteurs!I97","v":7.1264683671853781},{"$f":"moteurs!J97","v":10.418220651233897},{"$f":"moteurs!K97","v":8.1482198071255638},{"$f":"moteurs!L97","v":0},"moteur 3",{"$f":"CONCATENATE(moteurs!E71,\" \",moteurs!E72)","v":"Turnigy 4260 500KV"}]
[]
[null,null,null,null,"efficacité","hélice 1","hélice 2","hélice 3","hélice 4","hélice 5","hélice 6","efficacité",{"$f":"CONCATENATE(\"pour traction de \",FIXED(moteurs!H2,0),\" grs\")","v":"pour traction de 1.780 grs"}]
[null,null,null,null,"moteur 1",{"$f":"moteurs!G34","v":7.1628328673998807},{"$f":"moteurs!H34","v":7.4202553381937193},{"$f":"moteurs!I34","v":6.9755891614432048},{"$f":"moteurs!J34","v":9.1477411310496599},{"$f":"moteurs!K34","v":6.4446256393915258},{"$f":"moteurs!L34","v":0},"moteur 1",{"$f":"CONCATENATE(moteurs!E7,\" \",moteurs!E8)","v":"Turnigy Multistar 4014-320KV 22 Poles"}]
[null,null,null,null,"moteur 2",{"$f":"moteurs!G66","v":6.747255710377857},{"$f":"moteurs!H66","v":6.8135182244510979},{"$f":"moteurs!I66","v":6.4554653061484952},{"$f":"moteurs!J66","v":7.5594340035340997},{"$f":"moteurs!K66","v":4.9305854513095211},{"$f":"moteurs!L66","v":0},"moteur 2",{"$f":"CONCATENATE(moteurs!E39,\" \",moteurs!E40)","v":"Turnigy Multistar 4230-400Kv 16 Poles"}]
[null,null,null,null,"moteur 3",{"$f":"moteurs!G98","v":6.6247328395115295},{"$f":"moteurs!H98","v":6.8500439677084479},{"$f":"moteurs!I98","v":6.5123785851372515},{"$f":"moteurs!J98","v":8.7133650669257872},{"$f":"moteurs!K98","v":6.2197082103694692},{"$f":"moteurs!L98","v":0},"moteur 3",{"$f":"CONCATENATE(moteurs!E71,\" \",moteurs!E72)","v":"Turnigy 4260 500KV"}]
[]
[null,null,null,null,"efficacité","hélice 1","hélice 2","hélice 3","hélice 4","hélice 5","hélice 6","efficacité",{"$f":"CONCATENATE(\"pour traction de \",FIXED(moteurs!H3,0),\" grs\")","v":"pour traction de 2.497 grs"}]
[null,null,null,null,"moteur 1",{"$f":"moteurs!G35","v":6.3675172451107507},{"$f":"moteurs!H35","v":6.2419899481442682},{"$f":"moteurs!I35","v":6.3623229674050608},{"$f":"moteurs!J35","v":7.7706319974630924},{"$f":"moteurs!K35","v":5.0950740020987606},{"$f":"moteurs!L35","v":0},"moteur 1",{"$f":"CONCATENATE(moteurs!E7,\" \",moteurs!E8)","v":"Turnigy Multistar 4014-320KV 22 Poles"}]
[null,null,null,null,"moteur 2",{"$f":"moteurs!G67","v":6.1378213728050115},{"$f":"moteurs!H67","v":5.9044146247851472},{"$f":"moteurs!I67","v":6.0779533449706795},{"$f":"moteurs!J67","v":6.8798491404156072},{"$f":"moteurs!K67","v":4.2687651801786535},{"$f":"moteurs!L67","v":0},"moteur 2",{"$f":"CONCATENATE(moteurs!E39,\" \",moteurs!E40)","v":"Turnigy Multistar 4230-400Kv 16 Poles"}]
[null,null,null,null,"moteur 3",{"$f":"moteurs!G99","v":5.8992027288780751},{"$f":"moteurs!H99","v":5.8697601150321983},{"$f":"moteurs!I99","v":5.9652502199143571},{"$f":"moteurs!J99","v":7.7422132921986062},{"$f":"moteurs!K99","v":5.3318225257586809},{"$f":"moteurs!L99","v":0},"moteur 3",{"$f":"CONCATENATE(moteurs!E71,\" \",moteurs!E72)","v":"Turnigy 4260 500KV"}]
[]
[null,null,null,null,null,null,null,null,null,null,null,"efficacité max"]
[null,null,null,null,null,{"$f":"MAX(F16,F17,F18)","v":8.668241796471662},9.7428533212148167,8.1270743750258703,11.834030436476214,9.2784081175719955,0,{"$f":"MAX(F31,G31,H31,I31,J31,K31)","v":11.834030436476214},{"$f":"CONCATENATE(\"avec \",HLOOKUP(L31,F31:K34,4,FALSE),\" en stationnaire\")","v":"avec hélice 4 en stationnaire"}]
[null,null,null,null,null,{"$f":"MAX(F21,F22,F23)","v":7.1628328673998807},7.4202553381937193,6.9755891614432048,9.1477411310496599,6.4446256393915258,0,{"$f":"MAX(F32,G32,H32,I32,J32,K32)","v":9.1477411310496599},{"$f":"CONCATENATE(\"avec \",HLOOKUP(L32,F32:K34,3,FALSE),\" en traction 1,5 x stationnaire\")","v":"avec hélice 4 en traction 1,5 x stationnaire"}]
[null,null,null,null,null,{"$f":"MAX(F26,F27,F28)","v":6.3675172451107507},6.2419899481442682,6.3623229674050608,7.7706319974630924,5.3318225257586809,0,{"$f":"MAX(F33,G33,H33,I33,J33,K33)","v":7.7706319974630924},{"$f":"CONCATENATE(\"avec \",HLOOKUP(L33,F33:K34,2,FALSE),\" en traction max\")","v":"avec hélice 4 en traction max"}]
[null,null,null,null,null,{"$f":"IF(F31+F32+F33>0,\"hélice 1\",\"\")","v":"hélice 1"},{"$f":"IF(G31+G32+G33>0,\"hélice 2\",\"\")","v":"hélice 2"},{"$f":"IF(H31+H32+H33>0,\"hélice 3\",\"\")","v":"hélice 3"},{"$f":"IF(I31+I32+I33>0,\"hélice 4\",\"\")","v":"hélice 4"},{"$f":"IF(J31+J32+J33>0,\"hélice 5\",\"\")","v":"hélice 5"},{"$f":"IF(K31+K32+K33>0,\"hélice 6\",\"\")","v":""},"efficacité max"]
[null,null,null,"meilleur moteur par hélice",null,{"$f":"IF(F31+F32+F33>0,VLOOKUP(F31,$F$16:$L$18,7,FALSE),\"\")","v":"moteur 1"},{"$f":"IF(G31+G32+G33>0,VLOOKUP(G31,G$16:$L$18,6,FALSE),\"\")","v":"moteur 1"},{"$f":"IF(H31+H32+H33>0,VLOOKUP(H31,H$16:$L$18,5,FALSE),\"\")","v":"moteur 1"},{"$f":"IF(I31+I32+I33>0,VLOOKUP(I31,I$16:$L$18,4,FALSE),\"\")","v":"moteur 1"},{"$f":"IF(J31+J32+J33>0,VLOOKUP(J31,J$16:$L$18,3,FALSE),\"\")","v":"moteur 1"},{"$f":"IF(K31+K32+K33>0,VLOOKUP(K31,K$16:$L$18,2,FALSE),\"\")","v":""},{"$f":"MAX(F31,G31,H31,I31,J31,K31)","v":11.834030436476214},"grs/watt en stationnaire"]
[null,null,null,"et",null,{"$f":"IF(F31+F32+F33>0,VLOOKUP(F32,$F$21:$L$23,7,FALSE),\"\")","v":"moteur 1"},{"$f":"IF(G31+G32+G33>0,VLOOKUP(G32,$G$21:$L$23,6,FALSE),\"\")","v":"moteur 1"},{"$f":"IF(H31+H32+H33>0,VLOOKUP(H32,$H$21:$L$23,5,FALSE),\"\")","v":"moteur 1"},{"$f":"IF(I31+I32+I33>0,VLOOKUP(I32,$I$21:$L$23,4,FALSE),\"\")","v":"moteur 1"},{"$f":"IF(J31+J32+J33>0,VLOOKUP(J32,$J$21:$L$23,3,FALSE),\"\")","v":"moteur 1"},{"$f":"IF(K31+K32+K33>0,VLOOKUP(K32,$K$21:$L$23,2,FALSE),\"\")","v":""},{"$f":"MAX(F32,G32,H32,I32,J32,K32)","v":9.1477411310496599},"grs/watt en traction 1,5 x stationnaire",null,null,null,null,null,"traction","m1h1","m1h2","m1h3","m1h4","m1h5","m1h6","m2h1","m2h2","m2h3","m2h4","m2h5","m2h6","m3h1","m3h2","m3h3","m3h4","m3h5","m3h6"]
[null,null,null,"par force de traction",null,{"$f":"IF(F31+F32+F33>0,VLOOKUP(F33,$F$26:$L$28,7,FALSE),\"\")","v":"moteur 1"},{"$f":"IF(G31+G32+G33>0,VLOOKUP(G33,$G$26:$L$28,6,FALSE),\"\")","v":"moteur 1"},{"$f":"IF(H31+H32+H33>0,VLOOKUP(H33,$H$26:$L$28,5,FALSE),\"\")","v":"moteur 1"},{"$f":"IF(I31+I32+I33>0,VLOOKUP(I33,$I$26:$L$28,4,FALSE),\"\")","v":"moteur 1"},{"$f":"IF(J31+J32+J33>0,VLOOKUP(J33,$J$26:$L$28,3,FALSE),\"\")","v":"moteur 3"},{"$f":"IF(K31+K32+K33>0,VLOOKUP(K33,$K$26:$L$28,2,FALSE),\"\")","v":""},{"$f":"MAX(F33,G33,H33,I33,J33,K33)","v":7.7706319974630924},"grs/watt en traction max",null,null,null,null,null,850,{"$f":"F16","v":8.668241796471662},{"$f":"G16","v":9.7428533212148167},8.1270743750258703,11.834030436476214,9.2784081175719955,0,{"$f":"F17","v":8.4579552811783838},9.4124962621156616,7.7653567550481588,10.452672600405146,7.805111781336497,0,{"$f":"F18","v":7.5004719288841528},8.334250736510965,7.1264683671853781,10.418220651233897,8.1482198071255638,0]
[null,null,null,null,null,null,null,null,null,null,null,{"$f":"HLOOKUP(L35,F31:K35,5)","v":""},null,null,null,null,null,null,1275,{"$f":"F21","v":7.1628328673998807},{"$f":"G21","v":7.4202553381937193},6.9755891614432048,9.1477411310496599,6.4446256393915258,0,{"$f":"F22","v":6.747255710377857},6.8135182244510979,6.4554653061484952,7.5594340035340997,4.9305854513095211,0,{"$f":"F23","v":6.6247328395115295},6.8500439677084479,6.5123785851372515,8.7133650669257872,6.2197082103694692,0]
[null,null,null,null,null,null,null,"Efficacité moyenne dans la moitié ",null,null,null,null,null,null,null,null,null,null,1700,{"$f":"F26","v":6.3675172451107507},6.2419899481442682,6.3623229674050608,7.7706319974630924,5.0950740020987606,0,{"$f":"F27","v":6.1378213728050115},5.9044146247851472,6.0779533449706795,6.8798491404156072,4.2687651801786535,0,{"$f":"F28","v":5.8992027288780751},5.8697601150321983,5.9652502199143571,7.7422132921986062,5.3318225257586809,0]
[null,null,null,null,null,null,null,"inférieure de la gamme des tractions "]
[null,null,null,null,null,null,null,"moteur 1","moteur 2","moteur 3"]
[null,null,null,null,null,{"$f":"IF(L42>0,1,0)","v":0},"hélice 1",{"$f":"IF((F16+F21)>0,(F16+F21)/2,\"\")","v":7.9155373319357718},{"$f":"IF((F17+F22)>0,(F17+F22)/2,\"\")","v":7.6026054957781204},{"$f":"IF((F18+F23)>0,(F18+F23)/2,\"\")","v":7.0626023841978416},"hélice 1",{"$f":"IF(MAX(H42:J42)=$M$51,1,0)","v":0},{"$f":"CONCATENATE('test hélices'!C12,\" \",FIXED('test hélices'!C13,1),\" x \",FIXED('test hélices'!C14,2))","v":"RCTimer 13,0 x 4,00"}]
[null,null,null,null,null,{"$f":"IF(L43>0,2,0)","v":0},"hélice 2",{"$f":"IF((G16+G21)>0,(G16+G21)/2,\"\")","v":8.581554329704268},{"$f":"IF((G17+G22)>0,(G17+G22)/2,\"\")","v":8.1130072432833806},{"$f":"IF((G18+G23)>0,(G18+G23)/2,\"\")","v":7.5921473521097065},"hélice 2",0,{"$f":"CONCATENATE('test hélices'!C25,\" \",FIXED('test hélices'!C26,1),\" x \",FIXED('test hélices'!C27,2))","v":"RCTimer 13,0 x 6,50"}]
[null,null,null,null,null,{"$f":"IF(L44>0,3,0)","v":0},"hélice 3",{"$f":"IF((H16+H21)>0,(H16+H21)/2,\"\")","v":7.5513317682345376},{"$f":"IF((H17+H22)>0,(H17+H22)/2,\"\")","v":7.1104110305983266},{"$f":"IF((H18+H23)>0,(H18+H23)/2,\"\")","v":6.8194234761613153},"hélice 3",0,{"$f":"CONCATENATE('test hélices'!C38,\" \",FIXED('test hélices'!C39,1),\" x \",FIXED('test hélices'!C40,2))","v":"RCTimer 14,0 x 4,70"}]
[null,null,null,null,null,{"$f":"IF(L45>0,4,0)","v":4},"hélice 4",{"$f":"IF((I16+I21)>0,(I16+I21)/2,\"\")","v":10.490885783762938},{"$f":"IF((I17+I22)>0,(I17+I22)/2,\"\")","v":9.0060533019696223},{"$f":"IF((I18+I23)>0,(I18+I23)/2,\"\")","v":9.565792859079842},"hélice 4",1,{"$f":"CONCATENATE('test hélices'!C51,\" \",FIXED('test hélices'!C52,1),\" x \",FIXED('test hélices'!C53,2))","v":"RCTimer 18,0 x 4,00"}]
[null,null,null,null,null,{"$f":"IF(L46>0,5,0)","v":0},"hélice 5",{"$f":"IF((J16+J21)>0,(J16+J21)/2,\"\")","v":7.8615168784817602},{"$f":"IF((J17+J22)>0,(J17+J22)/2,\"\")","v":6.367848616323009},{"$f":"IF((J18+J23)>0,(J18+J23)/2,\"\")","v":7.1839640087475161},"hélice 5",0,{"$f":"CONCATENATE('test hélices'!C64,\" \",FIXED('test hélices'!C65,1),\" x \",FIXED('test hélices'!C66,2))","v":"HK 18,0 x 5,50"}]
[null,null,null,null,null,{"$f":"IF(L47>0,6,0)","v":0},"hélice 6",{"$f":"IF((K16+K21)>0,(K16+K21)/2,\"\")","v":""},{"$f":"IF((K17+K22)>0,(K17+K22)/2,\"\")","v":""},{"$f":"IF((K18+K23)>0,(K18+K23)/2,\"\")","v":""},"hélice 6",0,{"$f":"CONCATENATE('test hélices'!C77,\" \",FIXED('test hélices'!C78,1),\" x \",FIXED('test hélices'!C79,2))","v":" 0,0 x 0,00"}]
[null,null,null,null,null,null,null,"moteur 1","moteur 2","moteur 3"]
[null,null,null,null,null,null,null,{"$f":"IF(MAX(H42:H47)=$M$51,1,0)","v":1},{"$f":"IF(MAX(I42:I47)=$M$51,1,0)","v":0},{"$f":"IF(MAX(J42:J47)=$M$51,1,0)","v":0}]
[]
[null,null,null,null,null,null,null,null,null,null,null,"efficacité maximale dans la moitié inférieure de la plage des tractions:",{"$f":"MAX(H42:J47)","v":10.490885783762938},"grs/watt"]
[null,null,null,null,null,null,"avec le",{"$f":"CONCATENATE(IF(H49=1,H48,\"\"),IF(I49=1,I48,\"\"),IF(J49=1,J48,\"\"),\":\")","v":"moteur 1:"},{"$f":"CONCATENATE(IF(H49=1,M16,\"\"),IF(I49=1,M17,\"\"),IF(J49=1,M18,\"\"))","v":"Turnigy Multistar 4014-320KV 22 Poles"}]
[null,null,null,null,null,null,"et l'",{"$f":"CONCATENATE(IF(L42=1,K42,\"\"),IF(L43=1,K43,\"\"),IF(L44=1,K44,\"\"),IF(L45=1,K45,\"\"),IF(L46=1,K46,\"\"),IF(L47=1,K47,\"\"),\":\")","v":"hélice 4:"},{"$f":"INDEX(M42:M47,SUM(F42:F47),1)","v":"RCTimer 18,0 x 4,00"}]
[null,null,null,null,null,null,null,"batterie:",{"$f":"IF(H49=1,moteurs!E11,IF(I49=1,moteurs!E43,IF(J49=1,moteurs!E75,\"\")))","v":6},"S"]

{"sheet":"LiPo","index":9,"n_rows":63,"n_cols":31,"rows_kept":63,"cut":false,"hidden":false,"merged":[]}
[null,null,null,null,null,null,null,null,null,null,null,null,null,null,null,null,null,null,1,2,3,4,5,6,null,null,1,2,3]
[null,"Rappel:",null,null,null,null,null,null,null,null,null,null,null,null,null,null,null,null,"hélice 1","hélice 2","hélice 3","hélice 4","hélice 5","hélice 6",null,null,{"$f":"moteurs!E7","v":"Turnigy Multistar"},{"$f":"moteurs!E39","v":"Turnigy Multistar"},{"$f":"moteurs!E71","v":"Turnigy"}]
[null,null,null,null,null,null,null,{"$f":"'moteur-hélice'!L51","v":"efficacité maximale dans la moitié inférieure de la plage des tractions:"},{"$f":"'moteur-hélice'!M51","v":10.490885783762938},{"$f":"'moteur-hélice'!N51","v":"grs/watt"},null,null,null,"Choix moteur",1,null,null,"n100W",{"$f":"moteurs!Q5","v":5700},{"$f":"moteurs!R5","v":5100},{"$f":"moteurs!S5","v":5350},{"$f":"moteurs!T5","v":3450},{"$f":"moteurs!U5","v":3020},{"$f":"moteurs!V5","v":""},{"$f":"HLOOKUP(O4,S1:X8,3,FALSE)","v":3450},"n100W",{"$f":"moteurs!E8","v":"4014-320KV 22 Poles"},{"$f":"moteurs!E40","v":"4230-400Kv 16 Poles"},{"$f":"moteurs!E72","v":"4260 500KV"}]
[null,null,null,null,null,null,{"$f":"'moteur-hélice'!G52","v":"avec le"},{"$f":"'moteur-hélice'!H52","v":"moteur 1:"},null,{"$f":"'moteur-hélice'!I52","v":"Turnigy Multistar 4014-320KV 22 Poles"},null,null,null,"Choix hélice",4,null,null,"n10N",{"$f":"moteurs!Q6","v":5857},{"$f":"moteurs!R6","v":5100},{"$f":"moteurs!S6","v":5500},{"$f":"moteurs!T6","v":3200},{"$f":"moteurs!U6","v":3150},{"$f":"moteurs!V6","v":""},{"$f":"HLOOKUP(O4,S1:X8,4,FALSE)","v":3200},"n10N",{"$f":"moteurs!E9","v":720},{"$f":"moteurs!E41","v":550},{"$f":"moteurs!E73","v":1000},{"$f":"HLOOKUP($O$3,$AA$1:$AC$9,4,FALSE)","v":720},{"$f":"moteurs!F9","v":"watts"}]
[null,null,null,null,null,null,{"$f":"'moteur-hélice'!G53","v":"et l'"},{"$f":"'moteur-hélice'!H53","v":"hélice 4:"},null,{"$f":"'moteur-hélice'!N53","v":0},null,null,null,"poids du quadricoptère",{"$f":"moteurs!E4","v":4250},"grs",null," kf",{"$f":"moteurs!Q7","v":39},{"$f":"moteurs!R7","v":45},{"$f":"moteurs!S7","v":39},{"$f":"moteurs!T7","v":85},{"$f":"moteurs!U7","v":90},{"$f":"moteurs!V7","v":0},{"$f":"HLOOKUP(O4,S1:X8,5,FALSE)","v":85}," kf",{"$f":"moteurs!E10","v":320},{"$f":"moteurs!E42","v":400},{"$f":"moteurs!E74","v":500},{"$f":"HLOOKUP($O$3,$AA$1:$AC$9,5,FALSE)","v":320},"KV"]
[null,null,null,null,null,null,null,null,null,null,null,null,null,null,null,null,null,"exp_f",{"$f":"moteurs!Q8","v":1.85},{"$f":"moteurs!R8","v":"1,92"},{"$f":"moteurs!S8","v":1.91},{"$f":"moteurs!T8","v":"2,11"},{"$f":"moteurs!U8","v":2.11},{"$f":"moteurs!V8","v":0},{"$f":"HLOOKUP(O4,S1:X8,6,FALSE)","v":"2,11"},"exp_f",{"$f":"moteurs!E11","v":6},{"$f":"moteurs!E43","v":6},{"$f":"moteurs!E75","v":6},{"$f":"moteurs!F11","v":"S"}]
[null,"Batterie LiPo",1,2,3,null,null,null,null,null,null,null,null,"Le poids est considéré avec la batterie la plus lourde :",{"$f":"MAX(C9:E9)","v":1320},"grs",null,"kp",{"$f":"moteurs!Q9","v":1.6},{"$f":"moteurs!R9","v":"1,1"},{"$f":"moteurs!S9","v":2.2000000000000002},{"$f":"moteurs!T9","v":"2,6"},{"$f":"moteurs!U9","v":2.5},{"$f":"moteurs!V9","v":0},{"$f":"HLOOKUP(O4,S1:X8,7,FALSE)","v":"2,6"},"kp",{"$f":"moteurs!E12","v":0.10199999999999999},{"$f":"moteurs!E44","v":0.24},{"$f":"moteurs!E76","v":1.9E-2},{"$f":"HLOOKUP($O$3,$AA$1:$AC$9,7,FALSE)","v":0.10199999999999999},{"$f":"moteurs!F12","v":"ohm(s)"}]
[null,"capacité",6600,8000,10000,"mAh",null,null,null,null,null,null,null,"poids sans batterie",{"$f":"O5-O7","v":2930},"grs",null,"exp_p",{"$f":"moteurs!Q10","v":2.4300000000000002},{"$f":"moteurs!R10","v":"2,8"},{"$f":"moteurs!S10","v":2.36},{"$f":"moteurs!T10","v":"2,95"},{"$f":"moteurs!U10","v":3.27},{"$f":"moteurs!V10","v":0},{"$f":"HLOOKUP(O4,S1:X8,8,FALSE)","v":"2,95"},"exp_p",{"$f":"moteurs!E13","v":0.7},{"$f":"moteurs!E45","v":0.6},{"$f":"moteurs!E77","v":1.36},{"$f":"HLOOKUP($O$3,$AA$1:$AC$9,8,FALSE)","v":0.7},{"$f":"moteurs!F13","v":"ampères"}]
[null,"poids",855,1110,1320,"grs",null,null,null,null,null,null,null,null,null,null,null,null,null,null,null,null,null,null,null,null,{"$f":"moteurs!E14","v":26},{"$f":"moteurs!E46","v":25},{"$f":"moteurs!E78","v":0},{"$f":"HLOOKUP($O$3,$AA$1:$AC$9,9,FALSE)","v":26},{"$f":"moteurs!F14","v":"ampères"}]
[null,"éléments",{"$f":"IF(O3=1,moteurs!E11,IF(O3=2,moteurs!E43,IF(O3=3,moteurs!E75,\"\")))","v":6},{"$f":"C10","v":6},{"$f":"C10","v":6},"S"]
[null,"énergie",{"$f":"C10*C8*3.7/1000","v":146.52000000000001},{"$f":"D10*D8*3.7/1000","v":177.6},{"$f":"E10*E8*3.7/1000","v":222},"Watts.H"]
[null,"efficacité E",{"$f":"C11*1000/C9","v":171.36842105263159},{"$f":"D11*1000/D9","v":160},168.18181818181819,"W.H/Kg"]
[]
[null,"tractions",{"$f":"($O$8+C9)/4","v":946.25},{"$f":"($O$8+D9)/4","v":1010},{"$f":"($O$8+E9)/4","v":1062.5},"grs",1,"x sta"]
[null,null,{"$f":"(C14+C16)/2","v":1265.609375},{"$f":"(D14+D16)/2","v":1350.875},1421.09375,"grs",{"$f":"(moteurs!E3-1)/4+1","v":1.3374999999999999},"x sta"]
[null,null,{"$f":"(C14+C17)/2","v":1584.96875},{"$f":"(D14+D17)/2","v":1691.75},{"$f":"(E14+E17)/2","v":1779.6875},"grs",{"$f":"(moteurs!E3+1)/2","v":1.675},"x sta",null,null,null,null,null,null,null,null,null,null,"efficacité (grs/watt) selon le coefficient traction/poids",null,null,null,null,null,null,"temps de vol (minutes) selon le coefficient traction/poids"]
[null,null,{"$f":"C14*moteurs!$E$3","v":2223.6875},{"$f":"D14*moteurs!$E$3","v":2373.5},{"$f":"E14*moteurs!$E$3","v":2496.875},"grs",{"$f":"moteurs!E3","v":2.35},"x sta",null,null,null,null,null,null,null,null,null,null,null,null,null,null,null,null,null,{"$f":"CONCATENATE(\"remarque: pour \",FIXED(I44,0),\"% de la capacité de la batterie !!!\")","v":"remarque: pour 70% de la capacité de la batterie !!!"}]
[]
[null,null,null,null,null,"Batterie",1,2,3]
[null,null,null,null,null,"vitesse de rotation en stationnaire",{"$f":"IF($Y$5*$Y$6>0,(C$14/$Y$5)^(1/$Y$6)*1000,0)","v":3133.3779323869999},{"$f":"IF($Y$5*$Y$6>0,(D$14/$Y$5)^(1/$Y$6)*1000,0)","v":3231.7104296861194},{"$f":"IF($Y$5*$Y$6>0,(E$14/$Y$5)^(1/$Y$6)*1000,0)","v":3310.2635001316953},"trs/min"]
[null,null,null,null,null,"puissance mécanique en stationnaire",{"$f":"$Y$7*(G20/1000)^$Y$8","v":75.545926252688702},{"$f":"$Y$7*(H20/1000)^$Y$8","v":82.755915122299299},88.831688239372269,"watts"]
[null,null,null,null,null,"courant en stationnaire",{"$f":"$AD$5*G21/G20+$AD$8","v":8.4152188221496012},{"$f":"$AD$5*H21/H20+$AD$8","v":8.8943891370576278},9.2872741657781077,"ampères"]
[null,null,null,null,null,"tension en stationnaire",{"$f":"G21/(G22-$AD$8)+(G22*$AD$7)","v":10.650158358568635},{"$f":"H21/(H22-$AD$8)+(H22*$AD$7)","v":11.006322784749001},11.291875402820914,"volts"]
[null,null,null,null,null,"puissance électrique en stationnaire",{"$f":"G22*G23","v":89.623413077900679},{"$f":"H22*H23","v":97.89451781562137},104.87074271180393,"watts"]
[null,null,null,null,null,{"$f":"CONCATENATE(\"vitesse de rotation pour \",FIXED((moteurs!E3-1)/4+1,2),\" x traction stationnaire\")","v":"vitesse de rotation pour 1,34 x traction stationnaire"},{"$f":"IF($Y$5*$Y$6>0,(C$15/$Y$5)^(1/$Y$6)*1000,0)","v":3596.3972555358332},{"$f":"IF($Y$5*$Y$6>0,(D$15/$Y$5)^(1/$Y$6)*1000,0)","v":3709.2603480345838},3799.4212073565136,"trs/min"]
[null,null,null,null,null,"puissance mécanique",{"$f":"$Y$7*(G25/1000)^$Y$8","v":113.44436743158046},{"$f":"$Y$7*(H25/1000)^$Y$8","v":124.27132617143177},{"$f":"$Y$7*(I25/1000)^$Y$8","v":133.39507740612689},"watts"]
[null,null,null,null,null,"courant",{"$f":"$AD$5*G26/G25+$AD$8","v":10.794045512415735},{"$f":"$AD$5*H26/H25+$AD$8","v":11.4209579925899},{"$f":"$AD$5*I26/I25+$AD$8","v":11.934980919543827},"ampères"]
[null,null,null,null,null,"tension",{"$f":"G26/(G27-$AD$8)+(G27*$AD$7)","v":12.339734065815884},{"$f":"H26/(H27-$AD$8)+(H27*$AD$7)","v":12.756376302852244},{"$f":"I26/(I27-$AD$8)+(I27*$AD$7)","v":13.090559326782575},"volts"]
[null,null,null,null,null,"puissance électrique",{"$f":"G27*G28","v":133.19565111752351},{"$f":"H27*H28","v":145.69003789254472},{"$f":"I27*I28","v":156.23557579130653},"watts"]
[null,null,null,null,null,{"$f":"CONCATENATE(\"vitesse de rotation pour \",FIXED((moteurs!E3+1)/2,1),\" x traction stationnaire\")","v":"vitesse de rotation pour 1,7 x traction stationnaire"},{"$f":"IF($Y$5*$Y$6>0,(C$16/$Y$5)^(1/$Y$6)*1000,0)","v":4001.1141107197136},{"$f":"IF($Y$5*$Y$6>0,(D$16/$Y$5)^(1/$Y$6)*1000,0)","v":4126.6781349056164},4226.985153523291,"trs/min"]
[null,null,null,null,null,"puissance mécanique",{"$f":"$Y$7*(G30/1000)^$Y$8","v":155.38429213015849},{"$f":"$Y$7*(H30/1000)^$Y$8","v":170.21393381094845},{"$f":"$Y$7*(I30/1000)^$Y$8","v":182.71069904726374},"watts"]
[null,null,null,null,null,"courant",{"$f":"$AD$5*G31/G30+$AD$8","v":13.127282028381495},{"$f":"$AD$5*H31/H30+$AD$8","v":13.899105197660219},{"$f":"$AD$5*I31/I30+$AD$8","v":14.53194441702508},"ampères"]
[null,null,null,null,null,"tension",{"$f":"G31/(G32-$AD$8)+(G32*$AD$7)","v":13.842464362894018},{"$f":"H31/(H32-$AD$8)+(H32*$AD$7)","v":14.313577901741393},{"$f":"I31/(I32-$AD$8)+(I32*$AD$7)","v":14.691586935296844},"volts"]
[null,null,null,null,null,"puissance électrique",{"$f":"G32*G33","v":181.71393365952994},{"$f":"H32*H33","v":198.94592501120826},{"$f":"I32*I33","v":213.49732474162559},"watts"]
[null,null,null,null,null,{"$f":"CONCATENATE(\"vitesse de rotation pour \",FIXED(moteurs!E3,1),\" x traction stationnaire\")","v":"vitesse de rotation pour 2,4 x traction stationnaire"},{"$f":"IF($Y$5*$Y$6>0,(C$17/$Y$5)^(1/$Y$6)*1000,0)","v":4697.5815325052863},{"$f":"IF($Y$5*$Y$6>0,(D$17/$Y$5)^(1/$Y$6)*1000,0)","v":4845.0022820366321},4962.7695801440832,"trs/min"]
[null,null,null,null,null,"puissance mécanique",{"$f":"$Y$7*(G35/1000)^$Y$8","v":249.46097266622664},{"$f":"$Y$7*(H35/1000)^$Y$8","v":273.26915036080754},{"$f":"$Y$7*(I35/1000)^$Y$8","v":293.33202266466526},"watts"]
[null,null,null,null,null,"courant",{"$f":"$AD$5*G36/G35+$AD$8","v":17.693321074007923},{"$f":"$AD$5*H36/H35+$AD$8","v":18.748727952033036},{"$f":"$AD$5*I36/I35+$AD$8","v":19.614085318054936},"ampères"]
[null,null,null,null,null,"tension",{"$f":"G36/(G37-$AD$8)+(G37*$AD$7)","v":16.484661038627827},{"$f":"H36/(H37-$AD$8)+(H37*$AD$7)","v":17.053002382471846},{"$f":"I36/(I37-$AD$8)+(I37*$AD$7)","v":17.509291640391865},"volts"]
[null,null,null,null,null,"puissance électrique",{"$f":"G37*G38","v":291.66840055263106},{"$f":"H37*H38","v":319.72210243433585},{"$f":"I37*I38","v":343.42874009335213},"watts"]
[null,null,null,null,null,"efficacité électrique en stationnaire",{"$f":"C14/G24","v":10.558066999496207},{"$f":"D14/H24","v":10.317227384502534},10.131519740637904,"grs/watt"]
[null,null,null,null,null,{"$f":"CONCATENATE(\"efficacité électrique pour \",FIXED((moteurs!E3-1)/4+1,2),\" x traction stationnaire\")","v":"efficacité électrique pour 1,34 x traction stationnaire"},{"$f":"C15/G29","v":9.5018821138785192},{"$f":"D15/H29","v":9.2722537487178958},9.0958396818548053,"grs/watt"]
[null,null,null,null,null,{"$f":"CONCATENATE(\"efficacité électrique pour \",FIXED((moteurs!E3+1)/2,1),\" x traction stationnaire\")","v":"efficacité électrique pour 1,7 x traction stationnaire"},{"$f":"C16/G34","v":8.7223292021716503},{"$f":"D16/H34","v":8.5035669863792887},8.3358772863021926,"grs/watt"]
[null,null,null,null,null,{"$f":"CONCATENATE(\"efficacité électrique pour \",FIXED(moteurs!E3,1),\" x traction stationnaire\")","v":"efficacité électrique pour 2,4 x traction stationnaire"},{"$f":"C17/G39","v":7.6240261056279204},{"$f":"D17/H39","v":7.4236344060306765},7.2704311215225896,"grs/watt"]
[null,null,null,null,null,null,null,"pourcentage de la capacité de batterie utilisé",70,"%"]
[null,null,null,null,null,"temps de vol en stationnaire",{"$f":"$I$44/400*C$11/G24*60","v":17.165826954869154},{"$f":"$I$44/400*D$11/H24*60","v":19.049074877841907},22.227362367460657,"min"]
[null,null,null,null,null,{"$f":"CONCATENATE(\"temps de vol pour \",FIXED((moteurs!E3-1)/4+1,2),\" x traction stationnaire\")","v":"temps de vol pour 1,34 x traction stationnaire"},{"$f":"$I$44/400*C11/G29*60","v":11.55037711135598},{"$f":"$I$44/400*D11/H29*60","v":12.799777026452579},14.919777318282872,"min"]
[null,null,null,null,null,{"$f":"CONCATENATE(\"temps de vol pour \",FIXED((moteurs!E3+1)/2,1),\" x traction stationnaire\")","v":"temps de vol pour 1,7 x traction stationnaire"},{"$f":"$I$44/400*C11/G34*60","v":8.4663843273711219},{"$f":"$I$44/400*D11/H34*60","v":9.3734013395596847},10.918169596836753,"min",null,null,{"$f":"CONCATENATE(\"évolution du temps de vol en stationnaire en fonction du poids de la batterie pour un poids de \",FIXED(I52,0),\" grs sans batterie\")","v":"évolution du temps de vol en stationnaire en fonction du poids de la batterie pour un poids de 2.930 grs sans batterie"}]
[null,null,null,null,null,{"$f":"CONCATENATE(\"temps de vol pour \",FIXED(moteurs!E3,1),\" x traction stationnaire\")","v":"temps de vol pour 2,4 x traction stationnaire"},{"$f":"$I$44/400*C11/G39*60","v":5.2746886432847822},{"$f":"$I$44/400*D11/H39*60","v":5.8325651739481792},6.7874342705458437,"min",null,null,null,null,null,null,null,null,{"$f":"CONCATENATE(\"remarque: pour \",FIXED($I$44,0),\"% de la capacité de la batterie !!!\")","v":"remarque: pour 70% de la capacité de la batterie !!!"}]
[null,null,null,null,null,null,null,null,null,null,null,null,null,null,null,null,null,null,"le coefficient traction max/poids est ici agrandi 10 fois"]
[null,"Effets du poids de la machine avec différentes capacité de LiPos"]
[]
[null,null,null,null,null,null,null,"poids de la machine sans batterie",2930,"grs"]
[null,null,"C batt",{"$f":"$C$12*D54/1000","v":73.260000000000005},{"$f":"$C$12*E54/1000","v":126.46989473684211},179.67978947368422,232.88968421052633,286.0995789473684,339.30947368421056,"W.H"]
[null,null,"Pd batt",{"$f":"MIN(C9:E9)/2","v":427.5},{"$f":"D54+($I$54-$D$54)/5","v":738},{"$f":"E54+($I$54-$D$54)/5","v":1048.5},{"$f":"F54+($I$54-$D$54)/5","v":1359},{"$f":"G54+($I$54-$D$54)/5","v":1669.5},{"$f":"MAX(C9:E9)*1.5","v":1980},"grs"]
[null,null,"Pd mach",{"$f":"D54+$I$52","v":3357.5},3668,3978.5,4289,4599.5,4910,"grs"]
[null,null,"n",{"$f":" $Y$4 / (10 /(D55/4*0.009806))^0.5","v":2903.1798290839647},{"$f":" $Y$4 / (10 /(E55/4*0.009806))^0.5","v":3034.454225721654},3160.2803318693104,3281.2849775659538,3397.9832889524337,3510.8047168704784,"trs/min"]
[null,null,"P méca",{"$f":"(D56/$Y$3)^3*100","v":59.58878469293397},{"$f":"(E56/$Y$3)^3*100","v":68.043161893058951},76.863390873941256,86.034881619791378,95.544662550681707,105.38110163526279,"Watts"]
[null,null,"I",{"$f":"$AD$5*D57/D56+$AD$8","v":7.2681122852646354},{"$f":"$AD$5*E57/E56+$AD$8","v":7.8755281794045242},8.4829440735444077,9.0903599676842948,9.6977758618241801,10.305191755964071,"Amp."]
[null,null,"V",{"$f":"D57/(D58-$AD$8)+(D58*$AD$7)","v":9.8137844189843815},{"$f":"E57/(E58-$AD$8)+(E58*$AD$7)","v":10.285973329679431},10.741136332593126,11.181232271597404,11.607870915882421,12.022394299328582,"Volts"]
[null,null,"P élec 4 moteurs",{"$f":"D58*D59*4","v":285.31074840223619},{"$f":"E58*E59*4","v":324.02989124197495},364.46583518281346,406.56570492443507,450.28212150086193,495.57231448156136,"Watts"]
[null,null,"temps de vol",{"$f":"60*D53/D60*$I$44/100","v":10.784451750349424},{"$f":"60*E53/E60*$I$44/100","v":16.392733270958441},{"$f":"60*F53/F60*$I$44/100","v":20.705784820981759},24.05851408116207,26.685897001057082,28.756646564579377,"min"]
[null,null,"coefficient tr.max/poids",{"$f":"4*MAX($C$17:$E$17)/D55","v":2.9746835443037973},{"$f":"4*MAX($C$17:$E$17)/E55","v":2.7228735005452562},2.5103682292321228,2.3286313826066682,2.1714316773562343,2.0341140529531567]
[null,null,null,{"$f":"D62*10","v":29.746835443037973},{"$f":"E62*10","v":27.228735005452563},25.103682292321228,23.286313826066682,21.714316773562345,{"$f":"I62*10","v":20.341140529531568}]

{"sheet":"pour info","index":10,"n_rows":151,"n_cols":35,"rows_kept":151,"cut":false,"hidden":false,"merged":[]}
[null,null,null,"Pour information, voici des relevés d'hélices surprenants. "]
[null,null,null,"Les pas sont loin de correspondre à la théorie et, au delà de 15° d'incidence, un profil décroche. "]
[null,null,null,"Il n'y a vraiment aucun intérêt à choisir de grands pas !"]
[]
[null,null,null,"hélices",null,"angles à"]
[null,null,null,"diamètre","pas",25,50,75,100,"% du diamètre"]
[null,null,null,13,4,18.399999999999999,11.8,7.7,6.5,"degrés mesurés"]
[null,null,null,null,null,{"$f":"TAN(F7/180*PI())*PI()*$D$7*F6/100","v":3.3964735340585421},{"$f":"TAN(G7/180*PI())*PI()*$D$7*G6/100","v":4.2660338468171393},4.1414099201268861,4.6532105102955379,"pas correspondant"]
[null,null,null,null,null,{"$f":"ATAN($E7/($D7*F6/100*PI()))*180/PI()","v":21.393557771183353},{"$f":"ATAN($E7/($D7*G6/100*PI()))*180/PI()","v":11.082940165408045},{"$f":"ATAN($E7/($D7*H6/100*PI()))*180/PI()","v":7.4400774708158917},{"$f":"ATAN($E7/($D7*I6/100*PI()))*180/PI()","v":5.593794083406892},"dégrés théoriques"]
[null,null,null,14,7,17.7,9.1,5,2,"degrés mesurés"]
[null,null,null,null,null,{"$f":"TAN(F$10/180*PI())*PI()*$D$10*F6/100","v":3.5091353781647387},{"$f":"TAN(G$10/180*PI())*PI()*$D$10*G6/100","v":3.5224113047326608},2.8859642973570381,1.5358956605016814,"pas correspondant"]
[null,null,null,null,null,{"$f":"ATAN($E10/($D10*F6/100*PI()))*180/PI()","v":32.481636590529753},{"$f":"ATAN($E10/($D10*G6/100*PI()))*180/PI()","v":17.65678715141286},{"$f":"ATAN($E10/($D10*H6/100*PI()))*180/PI()","v":11.980813567686219},{"$f":"ATAN($E10/($D10*I6/100*PI()))*180/PI()","v":9.04306107903769},"dégrés théoriques"]
[null,null,null,18,4,22,15,10.8,8.5,"degrés mesurés"]
[null,null,null,null,null,{"$f":"TAN(F$13/180*PI())*PI()*$D$13*F6/100","v":5.7117862032360271},{"$f":"TAN(G$13/180*PI())*PI()*$D$13*G6/100","v":7.5760849302923949},8.0904264734765619,8.4512550223810461,"pas correspondant"]
[null,null,null,null,null,{"$f":"ATAN($E13/($D13*F6/100*PI()))*180/PI()","v":15.798442699792515},{"$f":"ATAN($E13/($D13*G6/100*PI()))*180/PI()","v":8.0522589621413854},{"$f":"ATAN($E13/($D13*H6/100*PI()))*180/PI()","v":5.3878589293179084},{"$f":"ATAN($E13/($D13*I6/100*PI()))*180/PI()","v":4.0461080717011146},"dégrés théoriques"]
[]
[]
[]
[]
[]
[]
[]
[]
[]
[]
[]
[]
[]
[]
[]
[]
[]
[]
[]
[]
[]
[]
[]
[]
[]
[]
[]
[null,null,null,"En bleu la traction par unité de surface selon le diamètre"]
[null,null,null,"En rouge la somme des tractions par unité de surface à l'intérieur d'une portion du diamètre"]
[]
[]
[]
[]
[]
[null,null,null,null,null,null,null,null,null,null,null,null,null,null,null,null,null,null,null,null,null,null,null,null,null,null,null,null,null,null,null,"portion",null,"traction/surface"]
[null,null,null,null,null,null,null,null,null,null,null,null,null,null,null,null,null,null,null,null,null,null,null,null,null,null,null,null,null,null,"traction","surface",null,"%"]
[null,null,null,null,null,null,null,null,null,null,null,null,null,null,null,null,null,null,null,null,null,null,null,null,null,null,null,null,null,1,{"$f":"(AD52/100)^3","v":1.0000000000000002E-6},{"$f":"(AD53-AD52)*(AE52+AE53)/2","v":4.500000000000001E-6},{"$f":"AF52+AG53","v":26.002499499999995},{"$f":"AG52*100/26.0025","v":99.999998077107946},{"$f":"(100-AH52)/96.154","v":1.9998045360413518E-8}]
[null,null,null,null,null,null,null,null,null,null,null,null,null,null,null,null,null,null,null,null,null,null,null,null,null,null,null,null,null,2,{"$f":"(AD53/100)^3","v":8.0000000000000013E-6},{"$f":"(AD54-AD53)*(AE53+AE54)/2","v":1.7499999999999998E-5},{"$f":"AF53+AG54","v":26.002494999999996},{"$f":"AG53*100/26.0025","v":99.999980771079677},1.9998045138724537E-7]
[null,null,null,null,null,null,null,null,null,null,null,null,null,null,null,null,null,null,null,null,null,null,null,null,null,null,null,null,null,3,{"$f":"(AD54/100)^3","v":2.6999999999999999E-5},4.5500000000000008E-5,{"$f":"AF54+AG55","v":26.002477499999998},99.99991346985864,8.9991203028195193E-7]
[null,null,null,null,null,null,null,null,null,null,null,null,null,null,null,null,null,null,null,null,null,null,null,null,null,null,null,null,null,4,6.4000000000000011E-5,9.450000000000002E-5,{"$f":"AF55+AG56","v":26.002431999999999},99.999738486683967,2.7197341351717209E-6]
[null,null,null,null,null,null,null,null,null,null,null,null,null,null,null,null,null,null,null,null,null,null,null,null,null,null,null,null,null,5,1.2500000000000003E-4,1.7050000000000002E-4,26.002337499999999,{"$f":"AG56*100/26.0025","v":99.999375060090372},6.4993646611440189E-6]
[null,null,null,null,null,null,null,null,null,null,null,null,null,null,null,null,null,null,null,null,null,null,null,null,null,null,null,null,null,6,2.1599999999999999E-4,2.7950000000000002E-4,26.002167,99.998719353908271,1.3318698044064253E-5]
[null,null,null,null,null,null,null,null,null,null,null,null,null,null,null,null,null,null,null,null,null,null,null,null,null,null,null,null,null,7,3.430000000000001E-4,4.2750000000000009E-4,26.001887499999999,99.997644457263718,2.4497605261166937E-5]
[null,null,null,null,null,null,null,null,null,null,null,null,null,null,null,null,null,null,null,null,null,null,null,null,null,null,null,null,null,8,5.1200000000000009E-4,6.2049999999999996E-4,26.001459999999998,99.996000384578394,4.159593383120349E-5]
[null,null,null,null,null,null,null,null,null,null,null,null,null,null,null,null,null,null,null,null,null,null,null,null,null,null,null,null,null,9,7.2899999999999994E-4,8.6450000000000003E-4,26.000839499999998,99.993614075569639,6.6413507814146638E-5]
[null,null,null,null,null,null,null,null,null,null,null,null,null,null,null,null,null,null,null,null,null,null,null,null,null,null,null,null,null,10,1.0000000000000002E-3,1.1655000000000001E-3,25.999974999999999,99.990289395250443,1.0099012781119044E-4]
[null,null,null,null,null,null,null,null,null,null,null,null,null,null,null,null,null,null,null,null,null,null,null,null,null,null,null,null,null,11,1.3309999999999999E-3,1.5295E-3,25.9988095,99.985807133929427,1.4760557096504584E-4]
[null,null,null,null,null,null,null,null,null,null,null,null,null,null,null,null,null,null,null,null,null,null,null,null,null,null,null,null,null,12,1.7279999999999999E-3,1.9624999999999998E-3,25.99728,99.979925007210838,2.0877959095994071E-4]
[null,null,null,null,null,null,null,null,null,null,null,null,null,null,null,null,null,null,null,null,null,null,null,null,null,null,null,null,null,13,2.1970000000000002E-3,2.4705000000000005E-3,25.995317499999999,99.97237765599462,2.872719180208808E-4]
[null,null,null,null,null,null,null,null,null,null,null,null,null,null,null,null,null,null,null,null,null,null,null,null,null,null,null,null,null,14,2.7440000000000008E-3,3.0595000000000006E-3,25.992846999999998,99.962876646476289,3.8608225891498005E-4]
[null,null,null,null,null,null,null,null,null,null,null,null,null,null,null,null,null,null,null,null,null,null,null,null,null,null,null,null,null,15,3.375E-3,3.7355000000000001E-3,25.989787499999998,99.951110470147086,5.0845029694983454E-4]
[null,null,null,null,null,null,null,null,null,null,null,null,null,null,null,null,null,null,null,null,null,null,null,null,null,null,null,null,null,16,4.0960000000000007E-3,4.5045000000000016E-3,25.986051999999997,99.936744543793836,6.57855691975001E-4]
[null,null,null,null,null,null,null,null,null,null,null,null,null,null,null,null,null,null,null,null,null,null,null,null,null,null,null,null,null,17,4.9130000000000016E-3,5.3725000000000005E-3,25.981547499999998,99.919421209499063,8.380180803808136E-4]
[null,null,null,null,null,null,null,null,null,null,null,null,null,null,null,null,null,null,null,null,null,null,null,null,null,null,null,null,null,18,5.8319999999999995E-3,6.3455000000000004E-3,25.976174999999998,99.89875973464089,1.0528970750994194E-3]
[null,null,null,null,null,null,null,null,null,null,null,null,null,null,null,null,null,null,null,null,null,null,null,null,null,null,null,null,null,19,6.8590000000000005E-3,7.4295000000000012E-3,25.969829499999999,99.874356311893081,1.3066922656043345E-3]
[null,null,null,null,null,null,null,null,null,null,null,null,null,null,null,null,null,null,null,null,null,null,null,null,null,null,null,null,null,20,8.0000000000000019E-3,8.6304999999999993E-3,25.962399999999999,99.845784059225068,1.6038432179101482E-3]
[null,null,null,null,null,null,null,null,null,null,null,null,null,null,null,null,null,null,null,null,null,null,null,null,null,null,null,null,null,21,9.2609999999999984E-3,9.9544999999999981E-3,25.9537695,99.812593019901925,1.9490294745728195E-3]
[null,null,null,null,null,null,null,null,null,null,null,null,null,null,null,null,null,null,null,null,null,null,null,null,null,null,null,null,null,22,1.0647999999999999E-2,1.1407500000000001E-2,25.943815000000001,99.774310162484369,2.3471705546896761E-3]
[null,null,null,null,null,null,null,null,null,null,null,null,null,null,null,null,null,null,null,null,null,null,null,null,null,null,null,null,null,23,1.2167000000000001E-2,1.29955E-2,25.9324075,99.730439380828756,2.8034259538994148E-3]
[null,null,null,null,null,null,null,null,null,null,null,null,null,null,null,null,null,null,null,null,null,null,null,null,null,null,null,null,null,24,1.3823999999999999E-2,1.47245E-2,25.919412000000001,99.680461494087112,3.3231951443818057E-3]
[null,null,null,null,null,null,null,null,null,null,null,null,null,null,null,null,null,null,null,null,null,null,null,null,null,null,null,null,null,25,1.5625E-2,1.6600500000000001E-2,25.904687500000001,99.623834246707048,3.9121175748585797E-3]
[null,null,null,null,null,null,null,null,null,null,null,null,null,null,null,null,null,null,null,null,null,null,null,null,null,null,null,null,null,26,1.7576000000000001E-2,1.86295E-2,25.888087000000002,99.559992308431873,4.5760726705922463E-3]
[null,null,null,null,null,null,null,null,null,null,null,null,null,null,null,null,null,null,null,null,null,null,null,null,null,null,null,null,null,27,1.9683000000000003E-2,2.0817500000000003E-2,25.869457500000003,99.488347274300551,5.3211798333865339E-3]
[null,null,null,null,null,null,null,null,null,null,null,null,null,null,null,null,null,null,null,null,null,null,null,null,null,null,null,null,null,28,2.1952000000000006E-2,2.3170500000000004E-2,25.848640000000003,99.408287664647645,6.153798441586986E-3]
[null,null,null,null,null,null,null,null,null,null,null,null,null,null,null,null,null,null,null,null,null,null,null,null,null,null,null,null,null,29,2.4388999999999997E-2,2.5694499999999999E-2,25.825469500000004,99.319178925103358,7.0805278500805134E-3]
[null,null,null,null,null,null,null,null,null,null,null,null,null,null,null,null,null,null,null,null,null,null,null,null,null,null,null,null,null,30,2.7E-2,2.8395500000000001E-2,25.799775000000004,99.220363426593607,8.1082073902946587E-3]
[null,null,null,null,null,null,null,null,null,null,null,null,null,null,null,null,null,null,null,null,null,null,null,null,null,null,null,null,null,31,2.9791000000000002E-2,3.1279500000000002E-2,25.771379500000005,99.111160465339893,9.2439163701989232E-3]
[null,null,null,null,null,null,null,null,null,null,null,null,null,null,null,null,null,null,null,null,null,null,null,null,null,null,null,null,null,32,3.2768000000000005E-2,3.4352500000000008E-2,25.740100000000005,98.990866262859356,1.0494974074304178E-2]
[null,null,null,null,null,null,null,null,null,null,null,null,null,null,null,null,null,null,null,null,null,null,null,null,null,null,null,null,null,33,3.5937000000000004E-2,3.7620500000000008E-2,25.705747500000005,98.858753965964837,1.1868939763662073E-2]
[null,null,null,null,null,null,null,null,null,null,null,null,null,null,null,null,null,null,null,null,null,null,null,null,null,null,null,null,null,34,3.9304000000000013E-2,4.1089500000000001E-2,25.668127000000005,98.714073646764746,1.3373612675866363E-2]
[null,null,null,null,null,null,null,null,null,null,null,null,null,null,null,null,null,null,null,null,null,null,null,null,null,null,null,null,null,35,4.287499999999999E-2,4.4765499999999993E-2,25.627037500000007,98.556052302663218,1.5017032025051291E-2]
[null,null,null,null,null,null,null,null,null,null,null,null,null,null,null,null,null,null,null,null,null,null,null,null,null,null,null,null,null,36,4.6655999999999996E-2,4.8654499999999996E-2,25.582272000000007,98.38389385635999,1.6807477001892907E-2]
[null,null,null,null,null,null,null,null,null,null,null,null,null,null,null,null,null,null,null,null,null,null,null,null,null,null,null,null,null,37,5.0652999999999997E-2,5.2762500000000004E-2,25.533617500000005,98.196779155850408,1.8753466773608923E-2]
[null,null,null,null,null,null,null,null,null,null,null,null,null,null,null,null,null,null,null,null,null,null,null,null,null,null,null,null,null,38,5.4872000000000004E-2,5.7095500000000007E-2,25.480855000000005,97.99386597442556,2.08637604839574E-2]
[null,null,null,null,null,null,null,null,null,null,null,null,null,null,null,null,null,null,null,null,null,null,null,null,null,null,null,null,null,39,5.9319000000000004E-2,6.1659500000000006E-2,25.423759500000006,97.774289010672064,2.3147357253238934E-2]
[null,null,null,null,null,null,null,null,null,null,null,null,null,null,null,null,null,null,null,null,null,null,null,null,null,null,null,null,null,40,6.4000000000000015E-2,6.6460500000000006E-2,25.362100000000005,97.537159888472274,2.5613496178294462E-2]
[null,null,null,null,null,null,null,null,null,null,null,null,null,null,null,null,null,null,null,null,null,null,null,null,null,null,null,null,null,41,6.8920999999999982E-2,7.1504499999999985E-2,25.295639500000004,97.281567157004133,2.8271656332506886E-2]
[null,null,null,null,null,null,null,null,null,null,null,null,null,null,null,null,null,null,null,null,null,null,null,null,null,null,null,null,null,42,7.4087999999999987E-2,7.6797499999999991E-2,25.224135000000004,97.006576290741293,3.1131556765799727E-2]
[null,null,null,null,null,null,null,null,null,null,null,null,null,null,null,null,null,null,null,null,null,null,null,null,null,null,null,null,null,43,7.9506999999999994E-2,8.2345499999999988E-2,25.147337500000003,96.711229689452949,3.4203156504638919E-2]
[null,null,null,null,null,null,null,null,null,null,null,null,null,null,null,null,null,null,null,null,null,null,null,null,null,null,null,null,null,44,8.5183999999999996E-2,8.8154499999999997E-2,25.064992000000004,96.394546678204023,3.7496654552030884E-2]
[null,null,null,null,null,null,null,null,null,null,null,null,null,null,null,null,null,null,null,null,null,null,null,null,null,null,null,null,null,45,9.1125000000000012E-2,9.4230500000000009E-2,24.976837500000002,96.055523507355062,4.1022489887523536E-2]
[null,null,null,null,null,null,null,null,null,null,null,null,null,null,null,null,null,null,null,null,null,null,null,null,null,null,null,null,null,46,9.7336000000000006E-2,0.10057949999999999,24.882607000000004,95.693133352562256,4.4791341467206189E-2]
[null,null,null,null,null,null,null,null,null,null,null,null,null,null,null,null,null,null,null,null,null,null,null,null,null,null,null,null,null,47,0.10382299999999998,0.10720749999999998,24.782027500000005,95.306326314777436,4.8814128223709508E-2]
[null,null,null,null,null,null,null,null,null,null,null,null,null,null,null,null,null,null,null,null,null,null,null,null,null,null,null,null,null,48,0.110592,0.11412049999999999,24.674820000000004,94.89402942024806,5.3102009066205672E-2]
[null,null,null,null,null,null,null,null,null,null,null,null,null,null,null,null,null,null,null,null,null,null,null,null,null,null,null,null,null,49,0.11764899999999999,0.1213245,24.560699500000005,94.455146620517269,5.7666382880407797E-2]
[null,null,null,null,null,null,null,null,null,null,null,null,null,null,null,null,null,null,null,null,null,null,null,null,null,null,null,null,null,50,0.125,0.12882549999999998,24.439375000000005,93.988558792423817,6.2518888528570668E-2]
[null,null,null,null,null,null,null,null,null,null,null,null,null,null,null,null,null,null,null,null,null,null,null,null,null,null,null,null,null,51,0.13265099999999999,0.13662950000000001,24.310549500000004,93.493123738102113,6.767140484949026E-2]
[null,null,null,null,null,null,null,null,null,null,null,null,null,null,null,null,null,null,null,null,null,null,null,null,null,null,null,null,null,52,0.14060800000000001,0.14474250000000002,24.173920000000003,92.967676184982224,7.3136050658503815E-2]
[null,null,null,null,null,null,null,null,null,null,null,null,null,null,null,null,null,null,null,null,null,null,null,null,null,null,null,null,null,53,0.14887700000000004,0.15317050000000004,24.029177500000003,92.411027785789841,7.8925184747490065E-2]
[null,null,null,null,null,null,null,null,null,null,null,null,null,null,null,null,null,null,null,null,null,null,null,null,null,null,null,null,null,54,0.15746400000000002,0.16191950000000005,23.876007000000001,91.821967118546283,8.5051405884869244E-2]
[null,null,null,null,null,null,null,null,null,null,null,null,null,null,null,null,null,null,null,null,null,null,null,null,null,null,null,null,null,55,0.16637500000000005,0.17099550000000005,23.714087500000002,91.199259686568595,9.1527552815602112E-2]
[null,null,null,null,null,null,null,null,null,null,null,null,null,null,null,null,null,null,null,null,null,null,null,null,null,null,null,null,null,56,0.17561600000000005,0.18040450000000002,23.543092000000001,90.54164791846938,9.8366704261191637E-2]
[null,null,null,null,null,null,null,null,null,null,null,null,null,null,null,null,null,null,null,null,null,null,null,null,null,null,null,null,null,57,0.18519299999999997,0.19015249999999997,23.3626875,89.847851168156907,0.1055821789196819]
[null,null,null,null,null,null,null,null,null,null,null,null,null,null,null,null,null,null,null,null,null,null,null,null,null,null,null,null,null,58,0.19511199999999998,0.20024549999999997,23.172535,89.116565714835104,0.11318753546565817]
[null,null,null,null,null,null,null,null,null,null,null,null,null,null,null,null,null,null,null,null,null,null,null,null,null,null,null,null,null,59,0.20537899999999998,0.21068949999999997,22.972289499999999,88.346464763003539,0.12119657255024713]
[null,null,null,null,null,null,null,null,null,null,null,null,null,null,null,null,null,null,null,null,null,null,null,null,null,null,null,null,null,60,0.216,0.22149049999999998,22.761599999999998,87.536198442457447,0.12962332880111646]
[null,null,null,null,null,null,null,null,null,null,null,null,null,null,null,null,null,null,null,null,null,null,null,null,null,null,null,null,null,61,0.22698099999999999,0.23265449999999999,22.540109499999996,86.684393808287638,0.13848208282247607]
[null,null,null,null,null,null,null,null,null,null,null,null,null,null,null,null,null,null,null,null,null,null,null,null,null,null,null,null,null,62,0.23832800000000001,0.2441875,22.307454999999997,85.789654840880658,0.14778735319507605]
[null,null,null,null,null,null,null,null,null,null,null,null,null,null,null,null,null,null,null,null,null,null,null,null,null,null,null,null,null,63,0.25004700000000002,0.25609550000000003,22.063267499999998,84.850562445918641,0.15755389847620857]
[null,null,null,null,null,null,null,null,null,null,null,null,null,null,null,null,null,null,null,null,null,null,null,null,null,null,null,null,null,64,0.26214400000000004,0.26838450000000003,21.807171999999998,83.865674454379374,0.16779671719970701]
[null,null,null,null,null,null,null,null,null,null,null,null,null,null,null,null,null,null,null,null,null,null,null,null,null,null,null,null,null,65,0.27462500000000006,0.28106050000000005,21.538787499999998,82.833525622536285,{"$f":"(100-AH116)/96.154","v":0.17853104787594604}]
[null,null,null,null,null,null,null,null,null,null,null,null,null,null,null,null,null,null,null,null,null,null,null,null,null,null,null,null,null,66,0.28749600000000003,{"$f":"(AD118-AD117)*(AE117+AE118)/2","v":0.29412950000000004},21.257726999999999,{"$f":"AG117*100/26.0025","v":81.752627631958461},0.18977236899184163]
[null,null,null,null,null,null,null,null,null,null,null,null,null,null,null,null,null,null,null,null,null,null,null,null,null,null,null,null,null,67,{"$f":"(AD118/100)^3","v":0.30076300000000006},0.30759750000000008,20.963597499999999,80.621469089510626,0.20153639901085107]
[null,null,null,null,null,null,null,null,null,null,null,null,null,null,null,null,null,null,null,null,null,null,null,null,null,null,null,null,null,68,0.3144320000000001,0.32147049999999999,{"$f":"AF119+AG120","v":20.655999999999999},79.438515527353132,0.21383909637297324]
[null,null,null,null,null,null,null,null,null,null,null,null,null,null,null,null,null,null,null,null,null,null,null,null,null,null,null,null,null,69,0.32850899999999994,0.33575449999999996,20.334529499999999,78.202209402942017,0.22669665949474785]
[null,null,null,null,null,null,null,null,null,null,null,null,null,null,null,null,null,null,null,null,null,null,null,null,null,null,null,null,null,70,0.34299999999999992,0.35045549999999992,19.998774999999998,76.91097009902893,0.2401255267692563]
[null,null,null,null,null,null,null,null,null,null,null,null,null,null,null,null,null,null,null,null,null,null,null,null,null,null,null,null,null,71,0.35791099999999998,0.36557949999999995,19.648319499999999,75.563193923661188,0.25414237656612115]
[null,null,null,null,null,null,null,null,null,null,null,null,null,null,null,null,null,null,null,null,null,null,null,null,null,null,null,null,null,72,0.37324799999999997,0.38113249999999999,19.28274,74.157254110181711,0.26876412723150667]
[null,null,null,null,null,null,null,null,null,null,null,null,null,null,null,null,null,null,null,null,null,null,null,null,null,null,null,null,null,73,0.38901699999999995,0.39712049999999999,18.901607500000001,72.691500817229112,0.28400793708811789]
[null,null,null,null,null,null,null,null,null,null,null,null,null,null,null,null,null,null,null,null,null,null,null,null,null,null,null,null,null,74,0.40522399999999997,0.41354950000000001,18.504487000000001,71.164261128737621,0.29989120443520167]
[null,null,null,null,null,null,null,null,null,null,null,null,null,null,null,null,null,null,null,null,null,null,null,null,null,null,null,null,null,75,0.421875,0.43042550000000002,18.090937500000003,69.573839053937121,0.3164315675485459]
[null,null,null,null,null,null,null,null,null,null,null,null,null,null,null,null,null,null,null,null,null,null,null,null,null,null,null,null,null,76,0.43897600000000003,0.44775450000000006,17.660512000000004,67.918515527353151,0.33364690468047975]
[null,null,null,null,null,null,null,null,null,null,null,null,null,null,null,null,null,null,null,null,null,null,null,null,null,null,null,null,null,77,0.45653300000000002,0.46554250000000003,17.212757500000006,66.196548408806862,0.35155533405987416]
[null,null,null,null,null,null,null,null,null,null,null,null,null,null,null,null,null,null,null,null,null,null,null,null,null,null,null,null,null,78,0.47455200000000003,0.48379550000000004,16.747215000000004,64.406172483415062,0.37017521389214114]
[null,null,null,null,null,null,null,null,null,null,null,null,null,null,null,null,null,null,null,null,null,null,null,null,null,null,null,null,null,79,0.49303900000000012,0.50251950000000012,16.263419500000005,62.545599461590243,0.38952514235923369]
[null,null,null,null,null,null,null,null,null,null,null,null,null,null,null,null,null,null,null,null,null,null,null,null,null,null,null,null,null,80,0.51200000000000012,0.52172050000000014,15.760900000000003,60.613017979040485,0.40962395761964676]
[null,null,null,null,null,null,null,null,null,null,null,null,null,null,null,null,null,null,null,null,null,null,null,null,null,null,null,null,null,81,0.53144100000000016,0.54140450000000007,15.239179500000002,58.606593596769549,0.43049073780841624]
[null,null,null,null,null,null,null,null,null,null,null,null,null,null,null,null,null,null,null,null,null,null,null,null,null,null,null,null,null,82,0.55136799999999986,0.56157749999999984,14.697775000000002,56.524468801076821,0.4521448010371194]
[null,null,null,null,null,null,null,null,null,null,null,null,null,null,null,null,null,null,null,null,null,null,null,null,null,null,null,null,null,83,0.57178699999999993,0.58224549999999997,14.136197500000002,54.36476300355735,0.47460570539387492]
[null,null,null,null,null,null,null,null,null,null,null,null,null,null,null,null,null,null,null,null,null,null,null,null,null,null,null,null,null,84,0.5927039999999999,0.60341449999999996,13.553952000000001,52.125572541101818,0.4978932489433428]
[null,null,null,null,null,null,null,null,null,null,null,null,null,null,null,null,null,null,null,null,null,null,null,null,null,null,null,null,null,85,0.61412499999999992,0.62509049999999999,12.950537500000001,49.804970675896548,0.52202746972672431]
[null,null,null,null,null,null,null,null,null,null,null,null,null,null,null,null,null,null,null,null,null,null,null,null,null,null,null,null,null,86,0.63605599999999995,0.64727950000000001,12.325447,47.401007595423522,0.54702864576176213]
[null,null,null,null,null,null,null,null,null,null,null,null,null,null,null,null,null,null,null,null,null,null,null,null,null,null,null,null,null,87,0.65850300000000006,0.66998749999999996,11.678167500000001,44.911710412460337,0.57291729504274047]
[null,null,null,null,null,null,null,null,null,null,null,null,null,null,null,null,null,null,null,null,null,null,null,null,null,null,null,null,null,88,0.68147199999999997,0.69322050000000002,11.008180000000001,42.335083165080285,0.59971417554048423]
[null,null,null,null,null,null,null,null,null,null,null,null,null,null,null,null,null,null,null,null,null,null,null,null,null,null,null,null,null,89,0.70496900000000007,0.71698450000000014,10.314959500000001,39.669106816652246,0.62744028520236039]
[null,null,null,null,null,null,null,null,null,null,null,null,null,null,null,null,null,null,null,null,null,null,null,null,null,null,null,null,null,90,0.72900000000000009,0.74128550000000004,9.5979749999999999,36.911739255840786,0.6561168619522767]
[null,null,null,null,null,null,null,null,null,null,null,null,null,null,null,null,null,null,null,null,null,null,null,null,null,null,null,null,null,91,0.7535710000000001,0.76612950000000013,8.8566894999999999,34.06091529660609,0.68576538369068285]
[null,null,null,null,null,null,null,null,null,null,null,null,null,null,null,null,null,null,null,null,null,null,null,null,null,null,null,null,null,92,0.77868800000000005,0.79152250000000013,8.09056,31.114546678204018,0.71640756829456897]
[null,null,null,null,null,null,null,null,null,null,null,null,null,null,null,null,null,null,null,null,null,null,null,null,null,null,null,null,null,93,0.8043570000000001,0.81747049999999999,7.299037499999999,28.070522065186037,0.74806537361746739]
[null,null,null,null,null,null,null,null,null,null,null,null,null,null,null,null,null,null,null,null,null,null,null,null,null,null,null,null,null,94,0.83058399999999988,0.84397949999999988,6.4815669999999992,24.926707047399283,0.7807609974894516]
[null,null,null,null,null,null,null,null,null,null,null,null,null,null,null,null,null,null,null,null,null,null,null,null,null,null,null,null,null,95,0.85737499999999989,0.87105549999999998,5.6375874999999995,21.680944139986536,0.81451687771713566]
[null,null,null,null,null,null,null,null,null,null,null,null,null,null,null,null,null,null,null,null,null,null,null,null,null,null,null,null,null,96,0.88473599999999997,0.89870450000000002,4.7665319999999998,18.331052783386212,0.84935569208367612]
[null,null,null,null,null,null,null,null,null,null,null,null,null,null,null,null,null,null,null,null,null,null,null,null,null,null,null,null,null,97,0.91267299999999996,0.92693249999999994,3.8678274999999998,14.874829343332371,0.88530035834877008]
[null,null,null,null,null,null,null,null,null,null,null,null,null,null,null,null,null,null,null,null,null,null,null,null,null,null,null,null,null,98,0.94119199999999992,0.95574549999999991,2.9408949999999998,11.310047110854724,0.92237403424865605]
[null,null,null,null,null,null,null,null,null,null,null,null,null,null,null,null,null,null,null,null,null,null,null,null,null,null,null,null,null,99,0.97029899999999991,0.9851494999999999,{"$f":"AF150+AG151","v":1.9851494999999999},7.6344563022786263,0.9606001174961144]
[null,null,null,null,null,null,null,null,null,null,null,null,null,null,null,null,null,null,null,null,null,null,null,null,null,null,null,null,null,100,1,1,1,{"$f":"AG151*100/26.0025","v":3.8457840592250743},{"$f":"(100-AH151)/96.154","v":1.000002245780466}]

{"sheet":"mesures hélices","index":11,"n_rows":98,"n_cols":53,"rows_kept":98,"cut":false,"hidden":false,"merged":[]}
["diamètre hélice conseillé",null,null,{"$f":"taille!E6","v":18}]
[null,null,null,null,null,null,"moteur de test","P",{"$f":"'moteur test'!T6","v":720},"watts",null,"gamme des forces de traction conseillée pour les test",null,null,null,null,null,null,null,null,{"$f":"IF(V2*X2>0,CONCATENATE(B10,\" \",C11),\"\")","v":"Helice 1 RCTimer"},{"$f":"C12","v":13},{"$f":"IF(V2*X2>0,\"x\",\"\")","v":"x"},{"$f":"C13","v":4},{"$f":"E19","v":8.6726692404114338},{"$f":"IF(Y2>0,\"grs/watt\",\"\")","v":"grs/watt"},null,null,null,{"$f":"IF(Y2=MAX($Y$2,$Y$3,$Y$4,$Y$5,$Y$6,$Y$7),CONCATENATE(\" à \",FIXED(E17,0),\" trs/min, meilleure hélice\"),CONCATENATE(\" à \",FIXED(E17,0),\" trs/min                                \"))","v":" à 5.862 trs/min                                "}]
[null,null,null,null,null,null,{"$f":"IF('moteur test'!R3=\"\",\"\",'moteur test'!R3)","v":"4014-320KV 22 Poles"},"KV",{"$f":"'moteur test'!T7","v":320},null,null,{"$f":"'moteur test'!AE29*0.8","v":850.40000000000009},{"$f":"($Q$3-$L$3)/5+L3","v":1106.3200000000002},{"$f":"($Q$3-$L$3)/5+M3","v":1362.2400000000002},{"$f":"($Q$3-$L$3)/5+N3","v":1618.1600000000003},{"$f":"($Q$3-$L$3)/5+O3","v":1874.0800000000004},{"$f":"'moteur test'!AN29","v":2130},"grs",null,null,{"$f":"IF(V3*X3>0,CONCATENATE(B25,\" \",C26),\"\")","v":"Helice 2 RCTimer"},{"$f":"C27","v":13},"x",{"$f":"C28","v":6.5},{"$f":"E34","v":8.5642776847571902},"grs/watt",null,null,null,{"$f":"IF(Y3=MAX($Y$2,$Y$3,$Y$4,$Y$5,$Y$6,$Y$7),CONCATENATE(\" à \",FIXED(E32,0),\" trs/min, meilleure hélice\"),CONCATENATE(\" à \",FIXED(E32,0),\" trs/min                                \"))","v":" à 5.155 trs/min                                "}]
[null,null,null,null,null,null,null,"V",{"$f":"'moteur test'!T8*3.7","v":22.200000000000003},"volts",null,null,null,null,null,null,null,null,null,null,{"$f":"IF(V4*X4>0,CONCATENATE(B40,\" \",C41),\"\")","v":"Helice 3 RCTimer"},{"$f":"C42","v":14},"x",{"$f":"C43","v":4.7},{"$f":"E49","v":8.5549258696803623},"grs/watt",null,null,null,{"$f":"IF(Y4=MAX($Y$2,$Y$3,$Y$4,$Y$5,$Y$6,$Y$7),CONCATENATE(\" à \",FIXED(E47,0),\" trs/min, meilleure hélice\"),CONCATENATE(\" à \",FIXED(E47,0),\" trs/min                                \"))","v":" à 5.640 trs/min                                "}]
[null,null,null,null,null,null,null,"ri",{"$f":"'moteur test'!T9","v":0.10199999999999999},"ohm",null,null,null,null,null,null,null,null,null,null,{"$f":"IF(V5*X5>0,CONCATENATE(B55,\" \",C56),\"\")","v":"Helice 4 Turnigy"},{"$f":"C57","v":18},"x",{"$f":"C58","v":4},{"$f":"E64","v":14.565543736312998},"grs/watt",null,null,null,{"$f":"IF(Y5=MAX($Y$2,$Y$3,$Y$4,$Y$5,$Y$6,$Y$7),CONCATENATE(\" à \",FIXED(E62,0),\" trs/min, meilleure hélice\"),CONCATENATE(\" à \",FIXED(E62,0),\" trs/min                                \"))","v":" à 3.085 trs/min, meilleure hélice"}]
[null,null,null,null,null,null,null,"I0",{"$f":"'moteur test'!T10","v":0.7},"ampère(s)",null,null,null,null,null,null,null,null,null,null,{"$f":"IF(V6*X6>0,CONCATENATE(B70,\" \",C71),\"\")","v":"Helice 5 Turnigy"},{"$f":"C72","v":18},"x",{"$f":"C73","v":5.5},{"$f":"E79","v":11.094042193817591},"grs/watt",null,null,null,{"$f":"IF(Y6=MAX($Y$2,$Y$3,$Y$4,$Y$5,$Y$6,$Y$7),CONCATENATE(\" à \",FIXED(E77,0),\" trs/min, meilleure hélice\"),CONCATENATE(\" à \",FIXED(E77,0),\" trs/min                                \"))","v":" à 3.216 trs/min                                "}]
[null,null,null,null,null,null,null,null,null,null,null,null,null,null,null,null,null,null,null,null,{"$f":"IF(V7*X7>0,CONCATENATE(B85,\" \",C86),\"\")","v":""},{"$f":"C87","v":0},"",{"$f":"C88","v":0},{"$f":"E94","v":0},"",null,null,null,{"$f":"IF(Y7=MAX($Y$2,$Y$3,$Y$4,$Y$5,$Y$6,$Y$7),CONCATENATE(\" à \",FIXED(E92,0),\" trs/min, meilleure hélice\"),CONCATENATE(\" à \",FIXED(E92,0),\" trs/min                                \"))","v":" à 0 trs/min                                "}]
[null,null,null,null,null,null,null,null,{"$f":"IF(('moteur test'!$G$10-I11)>0,'moteur test'!$G$10-I11,I11-'moteur test'!$G$10)","v":513},{"$f":"IF(('moteur test'!$G$10-J11)>0,'moteur test'!$G$10-J11,J11-'moteur test'!$G$10)","v":213},{"$f":"IF(('moteur test'!$G$10-K11)>0,'moteur test'!$G$10-K11,K11-'moteur test'!$G$10)","v":43},{"$f":"IF(('moteur test'!$G$10-L11)>0,'moteur test'!$G$10-L11,L11-'moteur test'!$G$10)","v":257},{"$f":"IF(('moteur test'!$G$10-M11)>0,'moteur test'!$G$10-M11,M11-'moteur test'!$G$10)","v":737},{"$f":"IF(('moteur test'!$G$10-N11)>0,'moteur test'!$G$10-N11,N11-'moteur test'!$G$10)","v":1063},null,null,null,null,null,null,null,null,null,null,null,null,null,null,null,null,null,null,null,null,null,"vitesse de rotation selon n10N et n100W"]
[null,null,null,null,null,null,null,null,{"$f":"IF(I8=MIN($I8:$N8),1,0)","v":0},0,1,0,0,0,null,null,null,null,"puissance = f (traction)",null,null,null,null,null,null,null,"efficacité = f (traction)",null,null,null,null,null,null,null,null,"vitesse de rotation = f (traction)"]
[null,"Helice 1",null,null,null,null,null,null,{"$f":"CONCATENATE(\"traction min: \",FIXED('moteur test'!G10,0),\" grs\")","v":"traction min: 1.063 grs"},null,null,null,null,null,null,null,null,null,null,null,null,null,null,null,null,null,null,null,null,null,null,null,null,null,null,null,null,null,null,null,null,null,{"$f":"IF(I11>0,1,0)","v":1},{"$f":"IF(J11>0,1,0)","v":1},1,1,1,0]
[null,"marque","RCTimer",null,null,null,null,"traction",550,850,1020,1320,1800,null,"grs",null,null,null,null,null,null,null,null,null,null,null,null,null,null,null,null,null,null,null,null,null,null,null,null,null,null,null,{"$f":"IF(I11>0,I11,0)","v":550},{"$f":"IF(J11>0,J11,AQ11)","v":850},{"$f":"IF(K11>0,K11,AR11)","v":1020},1320,1800,1800,"traction"]
[null,"diamètre",13,null,null,null,null,"vitesse",4162,5151,5742,7143,7914,null,"trs/min",null,null,null,null,null,null,null,null,null,null,null,null,null,null,null,null,null,null,null,null,null,null,null,null,null,null,null,{"$f":"IF(AQ10>0,$C$15/(10/(AQ11*0.009806))^0.5,\"\")","v":4216.2859158737028},{"$f":"IF(AR10>0,$C$15/(10/(AR11*0.009806))^0.5,AQ12)","v":5241.5311582738705},{"$f":"IF(AS10>0,$C$15/(10/(AS11*0.009806))^0.5,AR12)","v":5741.8097025055604},6531.8420540110947,7627.5482137162062,7627.5482137162062,"vitesse selon n10N"]
[null,"pas",4,null,null,null,null,"courant",4.0999999999999996,6.9,8.6,16,19.5,null,"ampères",null,null,null,null,null,null,null,null,null,null,null,null,null,null,null,null,null,null,null,null,null,null,null,null,null,null,null,{"$f":"IF(AQ10>0,$C$14/(100/AQ14)^(1/3),\"\")","v":4402.3061042381332},{"$f":"IF(AR10>0,$C$14/(100/AR14)^(1/3),AQ13)","v":5299.7139195395221},{"$f":"IF(AS10>0,$C$14/(100/AS14)^(1/3),AR13)","v":5742},6679.6404455791726,7410.5896776918889,7410.5896776918889,"vitesse selon n100W"]
[null,"n100W",{"$f":"SUM(I21:N21)","v":5477.338411846561},null,null,null,null,"puissance",64,105,132,212,290,null,"watts",null,null,null,null,null,null,null,null,null,null,null,null,null,null,null,null,null,null,null,null,null,null,null,null,null,null,null,{"$f":"IF(I17>0,I17,\"\")","v":51.919677741288815},{"$f":"IF(J17>0,J17,AQ14)","v":90.583387548196427},{"$f":"IF(K17>0,K17,AR14)","v":115.20752369368252},181.36376986752734,247.65641327011568,247.65641327011568,"puissance mécanique"]
[null,"n10N",{"$f":"SUM(I22:N22)","v":5741.2011674324622},null,null,null,null,"tension",{"$f":"(I14/(I13-$I$6))+($I$5*I13)","v":19.241729411764709},{"$f":"(J14/(J13-$I$6))+($I$5*J13)","v":17.639283870967741},17.58606075949367,15.488209150326796,17.414531914893615,0,"volts",null,null,null,null,null,null,null,null,null,null,null,null,null,null,null,null,null,null,null,null,null,null,null,null,null,null,null,{"$f":"(AQ11/$AZ15)^(1/$BA15)*1000","v":4180.6345631327276},{"$f":"(AR11/$AZ15)^(1/$BA15)*1000","v":5289.7453669597144},5837.6148818931588,6710.606865808918,7935.4550655449666,7935.4550655449666,"vitesse selon F, f et exp",null,null,{"$f":"'moteur-hélice'!G7","v":39},{"$f":"'moteur-hélice'!G8","v":1.85}]
[null,null,null,null,null,null,null,"rendement",{"$f":"IF(I15>0,(I15-($I$5*I13))*(I13-$I$6)/(I15*I13),0)","v":0.81124496470763774},{"$f":"IF(J15>0,(J15-($I$5*J13))*(J13-$I$6)/(J15*J13),0)","v":0.86269892903044221},0.87278427040668571,0.85548948050720441,{"$f":"IF(M15>0,(M15-($I$5*M13))*(M13-$I$6)/(M15*M13),0)","v":0.85398763196591609},0,null,null,null,null,null,null,null,null,null,null,null,null,null,null,null,null,null,null,null,null,null,null,null,null,null,null,null,null,{"$f":"(AQ14/$BA15)^(1/$BA16)*1000","v":3944.1254880257102},{"$f":"(AR14/$BA15)^(1/$BA16)*1000","v":4959.324928220316},{"$f":"(AS14/$BA15)^(1/$BA16)*1000","v":5475.1851773709695},{"$f":"(AT14/$BA15)^(1/$BA16)*1000","v":6599.2936107377218},{"$f":"(AU14/$BA15)^(1/$BA16)*1000","v":7501.9829046695841},{"$f":"(AV14/$BA15)^(1/$BA16)*1000","v":7501.9829046695841},"vitesse selon P, f et exp",null,null,{"$f":"'moteur-hélice'!G9","v":1.6},{"$f":"'moteur-hélice'!G10","v":2.4300000000000002}]
[null,null,null,{"$f":"CONCATENATE(\"vitesse pour \",FIXED('moteur test'!$G$10,0),\" grs\")","v":"vitesse pour 1.063 grs"},{"$f":"C15/((10/(9.80665*'moteur test'!$G$10/1000))^0.5)","v":5861.7829660587468},"trs/min",null,"P  méc",{"$f":"I14*I16","v":51.919677741288815},{"$f":"J14*J16","v":90.583387548196427},{"$f":"K14*K16","v":115.20752369368252},181.36376986752734,{"$f":"M14*M16","v":247.65641327011568},0,"watts",null,null,null,null,null,null,null,null,null,null,null,null,null,null,null,null,null,null,null,null,null,null,null,null,null,null,null,{"$f":"AQ11/AQ14","v":10.593286089728862},{"$f":"AR11/AR14","v":9.3836190388413456},8.8535884402134091,7.2781901311610433,7.2681340096642808,7.2681340096642808,"Eff selon n100W"]
[null,null,null,{"$f":"CONCATENATE(\"P mécanique pour \",FIXED('moteur test'!$G$10,0),\" grs\")","v":"P mécanique pour 1.063 grs"},{"$f":"IF(C14>0,100*(E17/C14)^3,0)","v":122.56895432455937},"watts",null,"n100W",{"$f":"IF(I17=0,0,(I12*(100/I17)^(1/3)))","v":5178.3501488365036},{"$f":"IF(J17=0,0,(J12*(100/J17)^(1/3)))","v":5323.6402167672204},{"$f":"IF(K17=0,0,(K12*(100/K17)^(1/3)))","v":5477.338411846561},5857.2955527440217,{"$f":"IF(M17=0,0,(M12*(100/M17)^(1/3)))","v":5849.4206367737788},0,"n100W",null,null,null,null,null,null,null,null,null,null,null,null,null,null,null,null,null,null,null,null,null,null,null,null,null,null,null,{"$f":"$AZ15/$AZ16*(AQ15/1000)^($BA15-($BA16))","v":10.632224653710509},9.2758231430227589,8.7604833579105872,8.0802124970446112,7.331502027785457,7.331502027785457,"Eff selon F"]
[null,null,null,"efficacité",{"$f":"IF(E18>0,'moteur test'!$G$10/E18,0)","v":8.6726692404114338},"grs/wattméc",null,"n10N",{"$f":"IF(I11=0,0,I12*(10/(9.80665*I11/1000))^0.5)","v":5667.0936999102969},{"$f":"IF(J11=0,0,J12*(10/(9.80665*J11/1000))^0.5)","v":5641.8527782173478},{"$f":"IF(K11=0,0,K12*(10/(9.80665*K11/1000))^0.5)","v":5741.2011674324622},6278.1739812418418,5956.6139683660786,0,"n10N",null,null,null,null,null,null,null,null,null,null,null,null,null,null,null,null,null,null,null,null,null,null,null,null,null,null,null,{"$f":"$AZ15/$AZ16*(AQ16/1000)^($BA15-($BA16))","v":10.997480594993197},9.6294068744425907,9.0922907154775832,8.1589843996220868,7.5743000206378257,7.5743000206378257,"Eff selon P"]
[null,null,null,null,null,null,null,"efficacité",{"$f":"IF(I17>0,I11/I17,0)","v":10.593286089728862},{"$f":"IF(J17>0,J11/J17,0)","v":9.3836190388413456},8.8535884402134091,7.2781901311610433,7.2681340096642808,0,"grs/W"]
[null,null,null,null,null,null,null,null,{"$f":"I9*I18","v":0},0,5477.338411846561,0,0,0]
[null,null,null,null,null,null,null,null,{"$f":"I9*I19","v":0},0,5741.2011674324622,0,0,0]
[null,null,null,null,null,null,null,null,{"$f":"IF(('moteur test'!$G$10-I26)>0,'moteur test'!$G$10-I26,I26-'moteur test'!$G$10)","v":213},{"$f":"IF(('moteur test'!$G$10-J26)>0,'moteur test'!$G$10-J26,J26-'moteur test'!$G$10)","v":63},{"$f":"IF(('moteur test'!$G$10-K26)>0,'moteur test'!$G$10-K26,K26-'moteur test'!$G$10)","v":637},{"$f":"IF(('moteur test'!$G$10-L26)>0,'moteur test'!$G$10-L26,L26-'moteur test'!$G$10)","v":1063},{"$f":"IF(('moteur test'!$G$10-M26)>0,'moteur test'!$G$10-M26,M26-'moteur test'!$G$10)","v":1063},{"$f":"IF(('moteur test'!$G$10-N26)>0,'moteur test'!$G$10-N26,N26-'moteur test'!$G$10)","v":1063}]
[null,null,null,null,null,null,null,null,{"$f":"IF(I23=MIN($I23:$N23),1,0)","v":0},{"$f":"IF(J23=MIN($I23:$N23),1,0)","v":1},{"$f":"IF(K23=MIN($I23:$N23),1,0)","v":0},{"$f":"IF(L23=MIN($I23:$N23),1,0)","v":0},{"$f":"IF(M23=MIN($I23:$N23),1,0)","v":0},{"$f":"IF(N23=MIN($I23:$N23),1,0)","v":0}]
[null,"Helice 2",null,null,null,null,null,null,{"$f":"CONCATENATE(\"traction min: \",FIXED('moteur test'!$G$10,0),\" grs\")","v":"traction min: 1.063 grs"},null,null,null,null,null,null,null,null,null,null,null,null,null,null,null,null,null,null,null,null,null,null,null,null,null,null,null,null,null,null,null,null,null,{"$f":"IF(I26>0,1,0)","v":1},{"$f":"IF(J26>0,1,0)","v":1},{"$f":"IF(K26>0,1,0)","v":1},{"$f":"IF(L26>0,1,0)","v":0},{"$f":"IF(M26>0,1,0)","v":0},{"$f":"IF(N26>0,1,0)","v":0}]
[null,"marque","RCTimer",null,null,null,null,"traction",850,1000,1700,null,null,null,"grs",null,null,null,null,null,null,null,null,null,null,null,null,null,null,null,null,null,null,null,null,null,null,null,null,null,null,null,{"$f":"IF(I26>0,I26,\"\")","v":850},{"$f":"IF(J26>0,J26,AQ26)","v":1000},{"$f":"IF(K26>0,K26,AR26)","v":1700},1700,1700,1700,"traction"]
[null,"diamètre",13,null,null,null,null,"vitesse",4660,5000,6600,null,null,null,"trs/min",null,null,null,null,null,null,null,null,null,null,null,null,null,null,null,null,null,null,null,null,null,null,null,null,null,null,null,{"$f":"IF(AQ25>0,$C$30/(10/(AQ26*0.009806))^0.5,\"\")","v":4609.6194546817887},{"$f":"IF(AR25>0,$C$30/(10/(AR26*0.009806))^0.5,AQ27)","v":4999.8342933695239},{"$f":"IF(AS25>0,$C$30/(10/(AS26*0.009806))^0.5,AR27)","v":6518.9863501898562},6518.9863501898562,6518.9863501898562,6518.9863501898562,"vitesse selon n10N"]
[null,"pas",6.5,null,null,null,null,"courant",6,9,22.2,null,null,null,"ampères",null,null,null,null,null,null,null,null,null,null,null,null,null,null,null,null,null,null,null,null,null,null,null,null,null,null,null,{"$f":"IF(AQ25>0,$C$29/(100/AQ29)^(1/3),\"\")","v":4441.4899198218163},{"$f":"IF(AR25>0,$C$29/(100/AR29)^(1/3),AQ28)","v":5000},{"$f":"IF(AS25>0,$C$29/(100/AS29)^(1/3),AR28)","v":6116.9766245788205},6116.9766245788205,6116.9766245788205,6116.9766245788205,"vitesse selon n100W"]
[null,"n100W",{"$f":"SUM(I36:N36)","v":4796.8462127023422},null,null,null,null,"puissance",93,130,255,null,null,null,"watts",null,null,null,null,null,null,null,null,null,null,null,null,null,null,null,null,null,null,null,null,null,null,null,null,null,null,null,{"$f":"IF(I32>0,I32,\"\")","v":79.381382242559496},{"$f":"IF(J32>0,J32,AQ29)","v":113.25115176752374},{"$f":"IF(K32>0,K32,AR29)","v":207.36863891735757},207.36863891735757,207.36863891735757,207.36863891735757,"puissance mécanique"]
[null,"n10N",{"$f":"SUM(I37:N37)","v":5049.0499427563809},null,null,null,null,"tension",{"$f":"(I29/(I28-$I$6))+($I$5*I28)","v":18.159169811320755},16.580650602409637,14.12486511627907,0,0,0,"volts",null,null,null,null,null,null,null,null,null,null,null,null,null,null,null,null,null,null,null,null,null,null,null,null,null,null,null,{"$f":"(AQ26/$AZ30)^(1/$BA30)*1000","v":4620.5198416483199},{"$f":"(AR26/$AZ30)^(1/$BA30)*1000","v":5028.6547065897275},6629.4468884380012,6629.4468884380012,6629.4468884380012,6629.4468884380012,"vitesse selon F, f et exp",null,null,{"$f":"'moteur-hélice'!J7","v":45},{"$f":"'moteur-hélice'!J8","v":"1,92"}]
[null,null,null,null,null,null,null,"rendement",{"$f":"IF(I30>0,(I30-($I$5*I28))*(I28-$I$6)/(I30*I28),0)","v":0.85356324991999466},{"$f":"IF(J30>0,(J30-($I$5*J28))*(J28-$I$6)/(J30*J28),0)","v":0.87116270590402878},0.81321034869551989,0,0,0,null,null,null,null,null,null,null,null,null,null,null,null,null,null,null,null,null,null,null,null,null,null,null,null,null,null,null,null,{"$f":"(AQ29/$BA30)^(1/$BA31)*1000","v":3778.2608538963418},{"$f":"(AR29/$BA30)^(1/$BA31)*1000","v":4289.509583240756},{"$f":"(AS29/$BA30)^(1/$BA31)*1000","v":5323.8919357045579},{"$f":"(AT29/$BA30)^(1/$BA31)*1000","v":5323.8919357045579},{"$f":"(AU29/$BA30)^(1/$BA31)*1000","v":5323.8919357045579},{"$f":"(AV29/$BA30)^(1/$BA31)*1000","v":5323.8919357045579},"vitesse selon P, f et exp",null,null,{"$f":"'moteur-hélice'!J9","v":"1,1"},{"$f":"'moteur-hélice'!J10","v":"2,8"}]
[null,null,null,{"$f":"CONCATENATE(\"vitesse pour \",FIXED('moteur test'!$G$10,0),\" grs\")","v":"vitesse pour 1.063 grs"},{"$f":"C30/((10/(9.80665*'moteur test'!$G$10/1000))^0.5)","v":5155.0945675128023},"trs/min",null,"P  méc",{"$f":"I29*I31","v":79.381382242559496},{"$f":"J29*J31","v":113.25115176752374},207.36863891735757,0,0,0,"watts",null,null,null,null,null,null,null,null,null,null,null,null,null,null,null,null,null,null,null,null,null,null,null,null,null,null,null,{"$f":"AQ26/AQ29","v":10.707800443720183},{"$f":"AR26/AR29","v":8.829932273472588},8.1979609302325578,8.1979609302325578,8.1979609302325578,8.1979609302325578,"Eff selon n100W"]
[null,null,null,{"$f":"CONCATENATE(\"P mécanique pour \",FIXED('moteur test'!$G$10,0),\" grs\")","v":"P mécanique pour 1.063 grs"},{"$f":"IF(C29>0,100*(E32/C29)^3,0)","v":124.12021645350673},"watts",null,"n100W",{"$f":"IF(I32=0,0,(I27*(100/I32)^(1/3)))","v":5032.838924486332},4796.8462127023422,5175.6262851528109,0,0,0,"n100W",null,null,null,null,null,null,null,null,null,null,null,null,null,null,null,null,null,null,null,null,null,null,null,null,null,null,null,{"$f":"$AZ30/$AZ31*(AQ30/1000)^($BA30-($BA31))","v":10.638781509769011},9.8751165664064882,7.7431880831289375,7.7431880831289375,7.7431880831289375,7.7431880831289375,"Eff selon F"]
[null,null,null,"efficacité",{"$f":"IF(E33>0,'moteur test'!$G$10/E33,0)","v":8.5642776847571902},"grs/wattméc",null,"n10N",{"$f":"IF(I26=0,0,I27*(10/(9.80665*I26/1000))^0.5)","v":5104.0640548423298},5049.0499427563809,5111.6267836074721,0,0,0,"n10N",null,null,null,null,null,null,null,null,null,null,null,null,null,null,null,null,null,null,null,null,null,null,null,null,null,null,null,{"$f":"$AZ30/$AZ31*(AQ31/1000)^($BA30-($BA31))","v":12.699976654497609},11.357980096072625,9.391567944686928,9.391567944686928,9.391567944686928,9.391567944686928,"Eff selon P"]
[null,null,null,null,null,null,null,"efficacité",{"$f":"IF(I32>0,I26/I32,0)","v":10.707800443720183},8.829932273472588,8.1979609302325578,0,0,0,"grs/W"]
[null,null,null,null,null,null,null,null,{"$f":"I24*I33","v":0},{"$f":"J24*J33","v":4796.8462127023422},0,0,0,0]
[null,null,null,null,null,null,null,null,{"$f":"I24*I34","v":0},{"$f":"J24*J34","v":5049.0499427563809},0,0,0,0]
[null,null,null,null,null,null,null,null,{"$f":"IF(('moteur test'!$G$10-I41)>0,'moteur test'!$G$10-I41,I41-'moteur test'!$G$10)","v":213},{"$f":"IF(('moteur test'!$G$10-J41)>0,'moteur test'!$G$10-J41,J41-'moteur test'!$G$10)","v":63},{"$f":"IF(('moteur test'!$G$10-K41)>0,'moteur test'!$G$10-K41,K41-'moteur test'!$G$10)","v":387},{"$f":"IF(('moteur test'!$G$10-L41)>0,'moteur test'!$G$10-L41,L41-'moteur test'!$G$10)","v":807},{"$f":"IF(('moteur test'!$G$10-M41)>0,'moteur test'!$G$10-M41,M41-'moteur test'!$G$10)","v":1063},{"$f":"IF(('moteur test'!$G$10-N41)>0,'moteur test'!$G$10-N41,N41-'moteur test'!$G$10)","v":1063}]
[null,null,null,null,null,null,null,null,{"$f":"IF(I38=MIN($I38:$N38),1,0)","v":0},{"$f":"IF(J38=MIN($I38:$N38),1,0)","v":1},{"$f":"IF(K38=MIN($I38:$N38),1,0)","v":0},{"$f":"IF(L38=MIN($I38:$N38),1,0)","v":0},{"$f":"IF(M38=MIN($I38:$N38),1,0)","v":0},{"$f":"IF(N38=MIN($I38:$N38),1,0)","v":0}]
[null,"Helice 3",null,null,null,null,null,null,{"$f":"CONCATENATE(\"traction min: \",FIXED('moteur test'!$G$10,0),\" grs\")","v":"traction min: 1.063 grs"},null,null,null,null,null,null,null,null,null,null,null,null,null,null,null,null,null,null,null,null,null,null,null,null,null,null,null,null,null,null,null,null,null,{"$f":"IF(I41>0,1,0)","v":1},{"$f":"IF(J41>0,1,0)","v":1},{"$f":"IF(K41>0,1,0)","v":1},{"$f":"IF(L41>0,1,0)","v":1},{"$f":"IF(M41>0,1,0)","v":0},{"$f":"IF(N41>0,1,0)","v":0}]
[null,"marque","RCTimer",null,null,null,null,"traction",850,1000,1450,1870,null,null,"grs",null,null,null,null,null,null,null,null,null,null,null,null,null,null,null,null,null,null,null,null,null,null,null,null,null,null,null,{"$f":"IF(I41>0,I41,\"\")","v":850},{"$f":"IF(J41>0,J41,AQ41)","v":1000},{"$f":"IF(K41>0,K41,AR41)","v":1450},1870,1870,1870,"traction"]
[null,"diamètre",14,null,null,null,null,"vitesse",5100,5470,6525,7560,null,null,"trs/min",null,null,null,null,null,null,null,null,null,null,null,null,null,null,null,null,null,null,null,null,null,null,null,null,null,null,null,{"$f":"IF(AQ40>0,$C$45/(10/(AQ41*0.009806))^0.5,\"\")","v":5042.9236834218764},{"$f":"IF(AR40>0,$C$45/(10/(AR41*0.009806))^0.5,AQ42)","v":5469.818716946259},{"$f":"IF(AS40>0,$C$45/(10/(AS41*0.009806))^0.5,AR42)","v":6586.5339408956679},7479.8645983064425,7479.8645983064425,7479.8645983064425,"vitesse selon n10N"]
[null,"pas",4.7,null,null,null,null,"courant",7.2,8.6,19.2,22.5,null,null,"ampères",null,null,null,null,null,null,null,null,null,null,null,null,null,null,null,null,null,null,null,null,null,null,null,null,null,null,null,{"$f":"IF(AQ40>0,$C$44/(100/AQ44)^(1/3),\"\")","v":5110.7504968255225},{"$f":"IF(AR40>0,$C$44/(100/AR44)^(1/3),AQ43)","v":5470},{"$f":"IF(AS40>0,$C$44/(100/AS44)^(1/3),AR43)","v":6711.8063077216493},7279.124002593293,7279.124002593293,7279.124002593293,"vitesse selon n100W"]
[null,"n100W",{"$f":"SUM(I51:N51)","v":5245.8389569424044},null,null,null,null,"puissance",107,130,249,319,null,null,"watts",null,null,null,null,null,null,null,null,null,null,null,null,null,null,null,null,null,null,null,null,null,null,null,null,null,null,null,{"$f":"IF(I47>0,I47,\"\")","v":92.471771310736855},{"$f":"IF(J47>0,J47,AQ44)","v":113.37495223578054},{"$f":"IF(K47>0,K47,AR44)","v":209.4466328799455},267.17295355192988,267.17295355192988,267.17295355192988,"puissance mécanique"]
[null,"n10N",{"$f":"SUM(I52:N52)","v":5523.6606373754803},null,null,null,null,"tension",{"$f":"(I44/(I43-$I$6))+($I$5*I43)","v":17.195938461538461},17.332896202531646,15.417859459459459,16.928027522935778,0,0,"volts",null,null,null,null,null,null,null,null,null,null,null,null,null,null,null,null,null,null,null,null,null,null,null,null,null,null,null,{"$f":"(AQ41/$AZ45)^(1/$BA45)*1000","v":5020.0618435764609},{"$f":"(AR41/$AZ45)^(1/$BA45)*1000","v":5465.9104147577591},6639.6987351632051,7585.565414399317,7585.565414399317,7585.565414399317,"vitesse selon F, f et exp",null,null,{"$f":"'moteur-hélice'!M7","v":39},{"$f":"'moteur-hélice'!M8","v":1.91}]
[null,null,null,null,null,null,null,"rendement",{"$f":"IF(I45>0,(I45-($I$5*I43))*(I43-$I$6)/(I45*I43),0)","v":0.86422216178258737},0.87211501719831186,0.84115113606403813,0.83753276975526603,0,0,null,null,null,null,null,null,null,null,null,null,null,null,null,null,null,null,null,null,null,null,null,null,null,null,null,null,null,null,{"$f":"(AQ44/$BA45)^(1/$BA46)*1000","v":5175.7441581273288},{"$f":"(AR44/$BA45)^(1/$BA46)*1000","v":5642.5597318403343},{"$f":"(AS44/$BA45)^(1/$BA46)*1000","v":7318.5279446094682},{"$f":"(AT44/$BA45)^(1/$BA46)*1000","v":8113.7190949268252},{"$f":"(AU44/$BA45)^(1/$BA46)*1000","v":8113.7190949268252},{"$f":"(AV44/$BA45)^(1/$BA46)*1000","v":8113.7190949268252},"vitesse selon P, f et exp",null,null,{"$f":"'moteur-hélice'!M9","v":2.2000000000000002},{"$f":"'moteur-hélice'!M10","v":2.36}]
[null,null,null,{"$f":"CONCATENATE(\"vitesse pour \",FIXED('moteur test'!$G$10,0),\" grs\")","v":"vitesse pour 1.063 grs"},{"$f":"C45/((10/(9.80665*'moteur test'!$G$10/1000))^0.5)","v":5639.6734568590055},"trs/min",null,"P  méc",{"$f":"I44*I46","v":92.471771310736855},113.37495223578054,209.4466328799455,267.17295355192988,0,0,"watts",null,null,null,null,null,null,null,null,null,null,null,null,null,null,null,null,null,null,null,null,null,null,null,null,null,null,null,10.369429370000001,9.3580751929999995,8.8869865010000009,7.4765071450000002,7.494503312,7.494503312,"Eff selon n100W"]
[null,null,null,{"$f":"CONCATENATE(\"P mécanique pour \",FIXED('moteur test'!$G$10,0),\" grs\")","v":"P mécanique pour 1.063 grs"},{"$f":"IF(C44>0,100*(E47/C44)^3,0)","v":124.25589843710907},"watts",null,"n100W",{"$f":"IF(I47=0,0,(I42*(100/I47)^(1/3)))","v":5234.804300664654},5245.8389569424044,5099.8341764824263,5448.2575788454287,0,0,"n100W",null,null,null,null,null,null,null,null,null,null,null,null,null,null,null,null,null,null,null,null,null,null,null,null,null,null,null,10.632224649999999,9.2758231430000002,8.7604833580000001,8.0802124969999998,7.3315020280000001,7.3315020280000001,"Eff selon F"]
[null,null,null,"efficacité",{"$f":"IF(E48>0,'moteur test'!$G$10/E48,0)","v":8.5549258696803623},"grs/wattméc",null,"n10N",{"$f":"IF(I41=0,0,I42*(10/(9.80665*I41/1000))^0.5)","v":5585.9928497201463},5523.6606373754803,5471.8751176872101,5582.6532586617532,0,0,"n10N",null,null,null,null,null,null,null,null,null,null,null,null,null,null,null,null,null,null,null,null,null,null,null,null,null,null,null,10.94155926,9.6231437979999992,9.1004654610000006,8.2115059749999997,7.6299509519999997,7.6299509519999997,"Eff selon P"]
[null,null,null,null,null,null,null,"efficacité",{"$f":"IF(I47>0,I41/I47,0)","v":9.1919943562420645},8.8202903752527906,6.9230045862381466,6.9992114663527563,0,0,"grs/W"]
[null,null,null,null,null,null,null,null,{"$f":"I39*I48","v":0},{"$f":"J39*J48","v":5245.8389569424044},0,0,0,0]
[null,null,null,null,null,null,null,null,{"$f":"I39*I49","v":0},{"$f":"J39*J49","v":5523.6606373754803},0,0,0,0]
[null,null,null,null,null,null,null,null,{"$f":"IF(('moteur test'!$G$10-I56)>0,'moteur test'!$G$10-I56,I56-'moteur test'!$G$10)","v":513},{"$f":"IF(('moteur test'!$G$10-J56)>0,'moteur test'!$G$10-J56,J56-'moteur test'!$G$10)","v":58},{"$f":"IF(('moteur test'!$G$10-K56)>0,'moteur test'!$G$10-K56,K56-'moteur test'!$G$10)","v":127},{"$f":"IF(('moteur test'!$G$10-L56)>0,'moteur test'!$G$10-L56,L56-'moteur test'!$G$10)","v":367},{"$f":"IF(('moteur test'!$G$10-M56)>0,'moteur test'!$G$10-M56,M56-'moteur test'!$G$10)","v":787},{"$f":"IF(('moteur test'!$G$10-N56)>0,'moteur test'!$G$10-N56,N56-'moteur test'!$G$10)","v":1247}]
[null,null,null,null,null,null,null,null,{"$f":"IF(I53=MIN($I53:$N53),1,0)","v":0},{"$f":"IF(J53=MIN($I53:$N53),1,0)","v":1},{"$f":"IF(K53=MIN($I53:$N53),1,0)","v":0},{"$f":"IF(L53=MIN($I53:$N53),1,0)","v":0},{"$f":"IF(M53=MIN($I53:$N53),1,0)","v":0},{"$f":"IF(N53=MIN($I53:$N53),1,0)","v":0}]
[null,"Helice 4",null,null,null,null,null,null,{"$f":"CONCATENATE(\"traction min: \",FIXED('moteur test'!$G$10,0),\" grs\")","v":"traction min: 1.063 grs"},null,null,null,null,null,null,null,null,null,null,null,null,null,null,null,null,null,null,null,null,null,null,null,null,null,null,null,null,null,null,null,null,null,{"$f":"IF(I56>0,1,0)","v":1},{"$f":"IF(J56>0,1,0)","v":1},{"$f":"IF(K56>0,1,0)","v":1},{"$f":"IF(L56>0,1,0)","v":1},{"$f":"IF(M56>0,1,0)","v":1},{"$f":"IF(N56>0,1,0)","v":1}]
[null,"marque","Turnigy",null,null,null,null,"traction",550,1005,1190,1430,1850,2310,"grs",null,null,null,null,null,null,null,null,null,null,null,null,null,null,null,null,null,null,null,null,null,null,null,null,null,null,null,{"$f":"IF(I56>0,I56,\"\")","v":550},{"$f":"IF(J56>0,J56,\"\")","v":1005},1190,1430,1850,2310,"traction"]
[null,"diamètre",18,null,null,null,null,"vitesse",2340,3000,3240,3600,4020,4560,"trs/min",null,null,null,null,null,null,null,null,null,null,null,null,null,null,null,null,null,null,null,null,null,null,null,null,null,null,null,{"$f":"IF(AQ55>0,$C$60/(10/(AQ56*0.009806))^0.5,\"\")","v":2219.2446176444264},{"$f":"IF(AR55>0,$C$60/(10/(AR56*0.009806))^0.5,\"\")","v":2999.9005760217137},3264.3544651565335,3578.4244227947256,4070.1432507615641,4548.0980669246546,"vitesse selon n10N"]
[null,"pas",4,null,null,null,null,"courant",2,4.0999999999999996,5.4,7.3,10.6,15.7,"ampères",null,null,null,null,null,null,null,null,null,null,null,null,null,null,null,null,null,null,null,null,null,null,null,null,null,null,null,{"$f":"IF(AQ55>0,$C$59/(100/AQ59)^(1/3),\"\")","v":2200.5692520063553},{"$f":"IF(AR55>0,$C$59/(100/AR59)^(1/3),\"\")","v":3000},3319.9984580056371,3709.1461848762874,4147.7088599208046,4687.1872667197458,"vitesse selon n100W"]
[null,"n100W",{"$f":"SUM(I66:N66)","v":3426.9097604735066},null,null,null,null,"puissance",41,82.3,107,145,200,290,"watts",null,null,null,null,null,null,null,null,null,null,null,null,null,null,null,null,null,null,null,null,null,null,null,null,null,null,null,{"$f":"IF(I62>0,I62,\"\")","v":26.478727838469222},{"$f":"IF(J62>0,J62,\"\")","v":67.089685923755425},90.929675364246933,126.79842084233319,177.30328727709116,255.87562128436502,"puissance mécanique"]
[null,"n10N",{"$f":"SUM(I67:N67)","v":3021.8846738239195},null,null,null,null,"tension",{"$f":"(I59/(I58-$I$6))+($I$5*I58)","v":31.742461538461537},24.62408235294118,23.316757446808509,22.714296969696971,21.2832202020202,20.934733333333334,"volts",null,null,null,null,null,null,null,null,null,null,null,null,null,null,null,null,null,null,null,null,null,null,null,null,null,null,null,{"$f":"(AQ56/$AZ60)^(1/$BA60)*1000","v":2422.889106611281},{"$f":"(AR56/$AZ60)^(1/$BA60)*1000","v":3224.1182725515246},3492.920028970424,3810.6878080316028,4305.3262551694434,4783.1317984290517,"vitesse selon F, f et exp",null,null,{"$f":"'moteur-hélice'!P7","v":85},{"$f":"'moteur-hélice'!P8","v":"2,11"}]
[null,null,null,null,null,null,null,"rendement",{"$f":"IF(I60>0,(I60-($I$5*I58))*(I58-$I$6)/(I60*I58),0)","v":0.64582263020656638},0.81518451912218015,0.84981005013314892,0.87447186787815989,0.88651643638545585,0.88232972856677594,null,null,null,null,null,null,null,null,null,null,null,null,null,null,null,null,null,null,null,null,null,null,null,null,null,null,null,null,{"$f":"(AQ59/$BA60)^(1/$BA61)*1000","v":2357.283136176145},{"$f":"(AR59/$BA60)^(1/$BA61)*1000","v":3230.5694803828778},{"$f":"(AS59/$BA60)^(1/$BA61)*1000","v":3581.3086998425297},{"$f":"(AT59/$BA60)^(1/$BA61)*1000","v":4008.6089461719166},{"$f":"(AU59/$BA60)^(1/$BA61)*1000","v":4491.0782408598798},{"$f":"(AV59/$BA60)^(1/$BA61)*1000","v":5085.7467526736173},"vitesse selon P, f et exp",null,null,{"$f":"'moteur-hélice'!P9","v":"2,6"},{"$f":"'moteur-hélice'!P10","v":"2,95"}]
[null,null,null,{"$f":"CONCATENATE(\"vitesse pour \",FIXED('moteur test'!$G$10,0),\" grs\")","v":"vitesse pour 1.063 grs"},{"$f":"C60/((10/(9.80665*'moteur test'!$G$10/1000))^0.5)","v":3085.3529757670558},"trs/min",null,"P  méc",{"$f":"I59*I61","v":26.478727838469222},67.089685923755425,90.929675364246933,126.79842084233319,177.30328727709116,255.87562128436502,"watts",null,null,null,null,null,null,null,null,null,null,null,null,null,null,null,null,null,null,null,null,null,null,null,null,null,null,null,10.369429370000001,9.3580751929999995,8.8869865010000009,7.4765071450000002,7.494503312,7.494503312,"Eff selon n100W"]
[null,null,null,{"$f":"CONCATENATE(\"P mécanique pour \",FIXED('moteur test'!$G$10,0),\" grs\")","v":"P mécanique pour 1.063 grs"},{"$f":"IF(C59>0,100*(E62/C59)^3,0)","v":72.980454368473787},"watts",null,"n100W",{"$f":"IF(I62=0,0,(I57*(100/I62)^(1/3)))","v":3644.0429367068359},3426.9097604735066,3344.3351749639,3326.0687292420912,3321.394461945561,3333.9202422554999,"n100W",null,null,null,null,null,null,null,null,null,null,null,null,null,null,null,null,null,null,null,null,null,null,null,null,null,null,null,10.632224649999999,9.2758231430000002,8.7604833580000001,8.0802124969999998,7.3315020280000001,7.3315020280000001,"Eff selon F"]
[null,null,null,"efficacité",{"$f":"IF(E63>0,'moteur test'!$G$10/E63,0)","v":14.565543736312998},"grs/wattméc",null,"n10N",{"$f":"IF(I56=0,0,I57*(10/(9.80665*I56/1000))^0.5)","v":3186.2083752499025},3021.8846738239195,2999.2398080764574,3040.0039243848832,2984.5568178595008,3029.6922426090532,"n10N",null,null,null,null,null,null,null,null,null,null,null,null,null,null,null,null,null,null,null,null,null,null,null,null,null,null,null,10.94155926,9.6231437979999992,9.1004654610000006,8.2115059749999997,7.6299509519999997,7.6299509519999997,"Eff selon P"]
[null,null,null,null,null,null,null,"efficacité",{"$f":"IF(I62>0,I56/I62,0)","v":20.771390655745204},14.9799479034995,13.087036715275701,11.277742975822434,10.434098704040402,9.0278237074910805,"grs/W"]
[null,null,null,null,null,null,null,null,{"$f":"I54*I63","v":0},{"$f":"J54*J63","v":3426.9097604735066},0,0,0,0]
[null,null,null,null,null,null,null,null,{"$f":"I54*I64","v":0},{"$f":"J54*J64","v":3021.8846738239195},0,0,0,0]
[null,null,null,null,null,null,null,null,{"$f":"IF(('moteur test'!$G$10-I71)>0,'moteur test'!$G$10-I71,I71-'moteur test'!$G$10)","v":543},{"$f":"IF(('moteur test'!$G$10-J71)>0,'moteur test'!$G$10-J71,J71-'moteur test'!$G$10)","v":283},{"$f":"IF(('moteur test'!$G$10-K71)>0,'moteur test'!$G$10-K71,K71-'moteur test'!$G$10)","v":138},{"$f":"IF(('moteur test'!$G$10-L71)>0,'moteur test'!$G$10-L71,L71-'moteur test'!$G$10)","v":487},{"$f":"IF(('moteur test'!$G$10-M71)>0,'moteur test'!$G$10-M71,M71-'moteur test'!$G$10)","v":752},{"$f":"IF(('moteur test'!$G$10-N71)>0,'moteur test'!$G$10-N71,N71-'moteur test'!$G$10)","v":1063}]
[null,null,null,null,null,null,null,null,{"$f":"IF(I68=MIN($I68:$N68),1,0)","v":0},{"$f":"IF(J68=MIN($I68:$N68),1,0)","v":0},{"$f":"IF(K68=MIN($I68:$N68),1,0)","v":1},{"$f":"IF(L68=MIN($I68:$N68),1,0)","v":0},{"$f":"IF(M68=MIN($I68:$N68),1,0)","v":0},{"$f":"IF(N68=MIN($I68:$N68),1,0)","v":0}]
[null,"Helice 5",null,null,null,null,null,null,{"$f":"CONCATENATE(\"traction min: \",FIXED('moteur test'!$G$10,0),\" grs\")","v":"traction min: 1.063 grs"},null,null,null,null,null,null,null,null,null,null,null,null,null,null,null,null,null,null,null,null,null,null,null,null,null,null,null,null,null,null,null,null,null,{"$f":"IF(I71>0,1,0)","v":1},{"$f":"IF(J71>0,1,0)","v":1},{"$f":"IF(K71>0,1,0)","v":1},{"$f":"IF(L71>0,1,0)","v":1},{"$f":"IF(M71>0,1,0)","v":1},{"$f":"IF(N71>0,1,0)","v":0}]
[null,"marque","Turnigy",null,null,null,null,"traction",520,780,925,1550,1815,null,"grs",null,null,null,null,null,null,null,null,null,null,null,null,null,null,null,null,null,null,null,null,null,null,null,null,null,null,null,{"$f":"IF(I71>0,I71,\"\")","v":520},{"$f":"IF(J71>0,J71,AQ71)","v":780},{"$f":"IF(K71>0,K71,AR71)","v":925},1550,1815,1815,"traction"]
[null,"diamètre",18,null,null,null,null,"vitesse",2340,2760,3000,3840,4200,null,"trs/min",null,null,null,null,null,null,null,null,null,null,null,null,null,null,null,null,null,null,null,null,null,null,null,null,null,null,null,{"$f":"IF(AQ70>0,$C$75/(10/(AQ71*0.009806))^0.5,\"\")","v":2249.2496772534787},{"$f":"IF(AR70>0,$C$60/(10/(AR71*0.009806))^0.5,AQ72)","v":2642.8415853519655},{"$f":"IF(AS70>0,$C$60/(10/(AS71*0.009806))^0.5,AR72)","v":2878.0258930141604},3725.543851223194,4031.4580514640602,4031.4580514640602,"vitesse selon n10N"]
[null,"pas",5.5,null,null,null,null,"courant",3.15,6.4,8.4,20.6,30,null,"ampères",null,null,null,null,null,null,null,null,null,null,null,null,null,null,null,null,null,null,null,null,null,null,null,null,null,null,null,{"$f":"IF(AQ70>0,$C$74/(100/AQ74)^(1/3),\"\")","v":1307.3647994890168},{"$f":"IF(AR70>0,$C$74/(100/AR74)^(1/3),AQ73)","v":2624.7865434864361},{"$f":"IF(AS70>0,$C$74/(100/AS74)^(1/3),AR73)","v":3000},3887.0261626922634,4139.8453374316914,4139.8453374316914,"vitesse selon n100W"]
[null,"n100W",{"$f":"SUM(I81:N81)","v":3262.1395592010481},null,null,null,null,"puissance",9,62,91,210,277,null,"watts",null,null,null,null,null,null,null,null,null,null,null,null,null,null,null,null,null,null,null,null,null,null,null,null,null,null,null,{"$f":"IF(I77>0,I77,\"\")","v":6.436988776650284},{"$f":"IF(J77>0,J77,AQ74)","v":52.092399441517593},{"$f":"IF(K77>0,K77,AR74)","v":77.777889347280151},169.1783483526786,204.38298541601895,204.38298541601895,"puissance mécanique"]
[null,"n10N",{"$f":"SUM(I82:N82)","v":3149.851290664174},null,null,null,null,"tension",{"$f":"(I74/(I73-$I$6))+($I$5*I73)","v":3.9947693877551016},11.52999298245614,12.674981818181818,12.653963819095477,12.513924914675766,0,"volts",null,null,null,null,null,null,null,null,null,null,null,null,null,null,null,null,null,null,null,null,null,null,null,null,null,null,null,{"$f":"(AQ71/$AZ75)^(1/$BA75)*1000","v":2296.2760281092901},{"$f":"(AR71/$AZ75)^(1/$BA75)*1000","v":2782.7850725749604},3016.9845879005516,3853.2240302941623,4152.5035217199675,4152.5035217199675,"vitesse selon F, f et exp",null,null,{"$f":"'moteur-hélice'!S7","v":90},{"$f":"'moteur-hélice'!S8","v":2.11}]
[null,null,null,null,null,null,null,"rendement",{"$f":"IF(I75>0,(I75-($I$5*I73))*(I73-$I$6)/(I75*I73),0)","v":0.71522097518336492},0.8401999909922192,0.8547020807393424,0.80561118263180287,0.73784471269320917,0,null,null,null,null,null,null,null,null,null,null,null,null,null,null,null,null,null,null,null,null,null,null,null,null,null,null,null,null,{"$f":"(AQ74/$BA75)^(1/$BA76)*1000","v":1406.483518219175},{"$f":"(AR74/$BA75)^(1/$BA76)*1000","v":2665.8671528982545},{"$f":"(AS74/$BA75)^(1/$BA76)*1000","v":3013.5231040459062},{"$f":"(AT74/$BA75)^(1/$BA76)*1000","v":3821.9240877131833},{"$f":"(AU74/$BA75)^(1/$BA76)*1000","v":4049.3850715461745},{"$f":"(AV74/$BA75)^(1/$BA76)*1000","v":4049.3850715461745},"vitesse selon P, f et exp",null,null,{"$f":"'moteur-hélice'!S9","v":2.5},{"$f":"'moteur-hélice'!S10","v":3.27}]
[null,null,null,{"$f":"CONCATENATE(\"vitesse pour \",FIXED('moteur test'!$G$10,0),\" grs\")","v":"vitesse pour 1.063 grs"},{"$f":"C75/((10/(9.80665*'moteur test'!$G$10/1000))^0.5)","v":3216.0072609841391},"trs/min",null,"P  méc",{"$f":"I74*I76","v":6.436988776650284},52.092399441517593,77.777889347280151,169.1783483526786,204.38298541601895,0,"watts",null,null,null,null,null,null,null,null,null,null,null,null,null,null,null,null,null,null,null,null,null,null,null,null,null,null,null,10.369429370000001,9.3580751929999995,8.8869865010000009,7.4765071450000002,7.494503312,7.494503312,"Eff selon n100W"]
[null,null,null,{"$f":"CONCATENATE(\"P mécanique pour \",FIXED('moteur test'!$G$10,0),\" grs\")","v":"P mécanique pour 1.063 grs"},{"$f":"IF(C74>0,100*(E77/C74)^3,0)","v":95.817194619322891},"watts",null,"n100W",{"$f":"IF(I77=0,0,(I72*(100/I77)^(1/3)))","v":5838.7732112062122},3430.1856681403774,3262.1395592010481,3222.6734225672767,3309.5405822924595,0,"n100W",null,null,null,null,null,null,null,null,null,null,null,null,null,null,null,null,null,null,null,null,null,null,null,null,null,null,null,10.632224649999999,9.2758231430000002,8.7604833580000001,8.0802124969999998,7.3315020280000001,7.3315020280000001,"Eff selon F"]
[null,null,null,"efficacité",{"$f":"IF(E78>0,'moteur test'!$G$10/E78,0)","v":11.094042193817591},"grs/wattméc",null,"n10N",{"$f":"IF(I71=0,0,I72*(10/(9.80665*I71/1000))^0.5)","v":3276.8295229775968},3155.7416585265382,3149.851290664174,3114.6197810810727,3148.1153570571719,0,"n10N",null,null,null,null,null,null,null,null,null,null,null,null,null,null,null,null,null,null,null,null,null,null,null,null,null,null,null,10.94155926,9.6231437979999992,9.1004654610000006,8.2115059749999997,7.6299509519999997,7.6299509519999997,"Eff selon P"]
[null,null,null,null,null,null,null,"efficacité",{"$f":"IF(I77>0,I71/I77,0)","v":80.783114285714277},14.973393592201106,11.89284008299393,9.1619289057532569,8.8803869671714146,0,"grs/W"]
[null,null,null,null,null,null,null,null,{"$f":"I69*I78","v":0},{"$f":"J69*J78","v":0},3262.1395592010481,0,0,0]
[null,null,null,null,null,null,null,null,{"$f":"I69*I79","v":0},{"$f":"J69*J79","v":0},3149.851290664174,0,0,0]
[null,null,null,null,null,null,null,null,{"$f":"IF(('moteur test'!$G$10-I86)>0,'moteur test'!$G$10-I86,I86-'moteur test'!$G$10)","v":1063},{"$f":"IF(('moteur test'!$G$10-J86)>0,'moteur test'!$G$10-J86,J86-'moteur test'!$G$10)","v":1063},{"$f":"IF(('moteur test'!$G$10-K86)>0,'moteur test'!$G$10-K86,K86-'moteur test'!$G$10)","v":1063},{"$f":"IF(('moteur test'!$G$10-L86)>0,'moteur test'!$G$10-L86,L86-'moteur test'!$G$10)","v":1063},{"$f":"IF(('moteur test'!$G$10-M86)>0,'moteur test'!$G$10-M86,M86-'moteur test'!$G$10)","v":1063},{"$f":"IF(('moteur test'!$G$10-N86)>0,'moteur test'!$G$10-N86,N86-'moteur test'!$G$10)","v":1063}]
[null,null,null,null,null,null,null,null,{"$f":"IF(I83=MIN($I83:$N83),1,0)","v":1},{"$f":"IF(J83=MIN($I83:$N83),1,0)","v":1},{"$f":"IF(K83=MIN($I83:$N83),1,0)","v":1},{"$f":"IF(L83=MIN($I83:$N83),1,0)","v":1},{"$f":"IF(M83=MIN($I83:$N83),1,0)","v":1},{"$f":"IF(N83=MIN($I83:$N83),1,0)","v":1}]
[null,"Helice 6",null,null,null,null,null,null,{"$f":"CONCATENATE(\"traction min: \",FIXED('moteur test'!$G$10,0),\" grs\")","v":"traction min: 1.063 grs"},null,null,null,null,null,null,null,null,null,null,null,null,null,null,null,null,null,null,null,null,null,null,null,null,null,null,null,null,null,null,null,null,null,{"$f":"IF(I86>0,1,0)","v":0},{"$f":"IF(J86>0,1,0)","v":0},{"$f":"IF(K86>0,1,0)","v":0},{"$f":"IF(L86>0,1,0)","v":0},{"$f":"IF(M86>0,1,0)","v":0},{"$f":"IF(N86>0,1,0)","v":0}]
[null,"marque",null,null,null,null,null,"traction",null,null,null,null,null,null,"grs",null,null,null,null,null,null,null,null,null,null,null,null,null,null,null,null,null,null,null,null,null,null,null,null,null,null,null,{"$f":"IF(I86>0,I86,\"\")","v":""},{"$f":"IF(J86>0,J86,AQ86)","v":""},{"$f":"IF(K86>0,K86,AR86)","v":""},"","","","traction"]
[null,"diamètre",null,null,null,null,null,"vitesse",null,null,null,null,null,null,"trs/min",null,null,null,null,null,null,null,null,null,null,null,null,null,null,null,null,null,null,null,null,null,null,null,null,null,null,null,{"$f":"IF(AQ85>0,$C$90/(10/(AQ86*0.009806))^0.5,\"\")","v":""},{"$f":"IF(AR85>0,$C$90/(10/(AR86*0.009806))^0.5,AQ87)","v":""},{"$f":"IF(AS85>0,$C$90/(10/(AS86*0.009806))^0.5,AR87)","v":""},"","","","vitesse selon n10N"]
[null,"pas",null,null,null,null,null,"courant",null,null,null,null,null,null,"ampères",null,null,null,null,null,null,null,null,null,null,null,null,null,null,null,null,null,null,null,null,null,null,null,null,null,null,null,{"$f":"IF(AQ85>0,$C$89/(100/AQ89)^(1/3),\"\")","v":""},{"$f":"IF(AR85>0,$C$89/(100/AR89)^(1/3),AQ88)","v":""},{"$f":"IF(AS85>0,$C$89/(100/AS89)^(1/3),AR88)","v":""},"","","","vitesse selon n100W"]
[null,"n100W",{"$f":"SUM(I96:N96)","v":0},null,null,null,null,"puissance",null,null,null,null,null,null,"watts",null,null,null,null,null,null,null,null,null,null,null,null,null,null,null,null,null,null,null,null,null,null,null,null,null,null,null,{"$f":"IF(I92>0,I92,\"\")","v":""},{"$f":"IF(J92>0,J92,AQ89)","v":""},{"$f":"IF(K92>0,K92,AR89)","v":""},"","","","puissance mécanique"]
[null,"n10N",{"$f":"SUM(I97:N97)","v":0},null,null,null,null,"tension",{"$f":"(I89/(I88-$I$6))+($I$5*I88)","v":0},0,0,0,0,0,"volts",null,null,null,null,null,null,null,null,null,null,null,null,null,null,null,null,null,null,null,null,null,null,null,null,null,null,null,{"$f":"(AQ86/$AZ90)^(1/$BA90)*1000","v":{"$error":"#VALUE!"}},{"$f":"(AR86/$AZ90)^(1/$BA90)*1000","v":{"$error":"#VALUE!"}},{"$error":"#VALUE!"},{"$error":"#VALUE!"},{"$error":"#VALUE!"},{"$error":"#VALUE!"},"vitesse selon F, f et exp",null,null,{"$f":"'moteur-hélice'!V7","v":0},{"$f":"'moteur-hélice'!V8","v":0}]
[null,null,null,null,null,null,null,"rendement",{"$f":"IF(I90>0,(I90-($I$5*I88))*(I88-$I$6)/(I90*I88),0)","v":0},0,0,0,0,0,null,null,null,null,null,null,null,null,null,null,null,null,null,null,null,null,null,null,null,null,null,null,null,null,null,null,null,null,{"$f":"(AQ89/$BA90)^(1/$BA91)*1000","v":{"$error":"#VALUE!"}},{"$f":"(AR89/$BA90)^(1/$BA91)*1000","v":{"$error":"#VALUE!"}},{"$f":"(AS89/$BA90)^(1/$BA91)*1000","v":{"$error":"#VALUE!"}},{"$f":"(AT89/$BA90)^(1/$BA91)*1000","v":{"$error":"#VALUE!"}},{"$f":"(AU89/$BA90)^(1/$BA91)*1000","v":{"$error":"#VALUE!"}},{"$f":"(AV89/$BA90)^(1/$BA91)*1000","v":{"$error":"#VALUE!"}},"vitesse selon P, f et exp",null,null,{"$f":"'moteur-hélice'!V9","v":0},{"$f":"'moteur-hélice'!V10","v":0}]
[null,null,null,{"$f":"CONCATENATE(\"vitesse pour \",FIXED('moteur test'!$G$10,0),\" grs\")","v":"vitesse pour 1.063 grs"},{"$f":"C90/((10/(9.80665*'moteur test'!$G$10/1000))^0.5)","v":0},"trs/min",null,"P  méc",{"$f":"I89*I91","v":0},0,0,0,0,0,"watts",null,null,null,null,null,null,null,null,null,null,null,null,null,null,null,null,null,null,null,null,null,null,null,null,null,null,null,10.369429370000001,9.3580751929999995,8.8869865010000009,7.4765071450000002,7.494503312,7.494503312,"Eff selon n100W"]
[null,null,null,{"$f":"CONCATENATE(\"P mécanique pour \",FIXED('moteur test'!$G$10,0),\" grs\")","v":"P mécanique pour 1.063 grs"},{"$f":"IF(C89>0,100*(E92/C89)^3,0)","v":0},"watts",null,"n100W",{"$f":"IF(I92=0,0,(I87*(100/I92)^(1/3)))","v":0},0,0,0,0,0,"n100W",null,null,null,null,null,null,null,null,null,null,null,null,null,null,null,null,null,null,null,null,null,null,null,null,null,null,null,10.632224649999999,9.2758231430000002,8.7604833580000001,8.0802124969999998,7.3315020280000001,7.3315020280000001,"Eff selon F"]
[null,null,null,"efficacité",{"$f":"IF(E93>0,'moteur test'!$G$10/E93,0)","v":0},"grs/wattméc",null,"n10N",{"$f":"IF(I86=0,0,I87*(10/(9.80665*I86/1000))^0.5)","v":0},0,0,0,0,0,"n10N",null,null,null,null,null,null,null,null,null,null,null,null,null,null,null,null,null,null,null,null,null,null,null,null,null,null,null,10.94155926,9.6231437979999992,9.1004654610000006,8.2115059749999997,7.6299509519999997,7.6299509519999997,"Eff selon P"]
[null,null,null,null,null,null,null,"efficacité",{"$f":"IF(I92>0,I86/I92,0)","v":0},0,0,0,0,0,"grs/W"]
[null,null,null,null,null,null,null,null,{"$f":"I84*I93","v":0},{"$f":"J84*J93","v":0},0,0,0,0]
[null,null,null,null,null,null,null,null,{"$f":"I84*I94","v":0},{"$f":"J84*J94","v":0},0,0,0,0]
[null,null,null,null,null,"Efficacité en fonction de la traction"]